program: Gaussian 09
title: 000216589
version: EM64L-G09RevD.01
frameworkgroup: C1[X(C21H26N2O3)]
method: RPBEPBE
basis: SDD
operation: Freq
keyword: #p
keyword: freq=noraman
keyword: PBEPBE/SDD
title: #p freq=noraman PBEPBE/SDD
converged: YES YES NO NO
title: Mulliken charges:
elementType: O O O N N C C C C C C C C C C C C C C C C C C C C C H H H H H H H H H H H H H H H H H H H H H H H H H H
charge: -0.273850 -0.241791 -0.228388 -0.090946 -0.496500 -0.393888 -0.533419 -0.501114 0.046294 0.338332 -0.315025 0.328576 -0.408789 -0.424373 -0.382426 -0.240070 -0.670485 0.120535 0.288271 -0.490872 -0.381009 0.220973 -0.352967 0.208658 -0.537600 -0.538030 0.216880 0.188937 0.239377 0.188064 0.192638 0.238763 0.180744 0.201396 0.209491 0.203378 0.231430 0.311302 0.225221 0.337912 0.208235 0.242098 0.200704 0.291854 0.204082 0.242868 0.229084 0.225938 0.245577 0.250630 0.221490 0.221810
chargesum: 0.00000
title: Mulliken charges with hydrogens summed into heavy atoms:
elementType: O O O N N C C C C C C C C C C C C C C C C C C C C C
charge: -0.273850 -0.241791 -0.228388 -0.090946 -0.158588 0.011929 -0.105978 -0.069713 0.046294 0.338332 0.067115 0.328576 0.004080 -0.192944 -0.071124 -0.014848 -0.019448 0.120535 0.288271 -0.199017 -0.176927 0.220973 -0.110098 0.208658 0.162999 0.155900
polarizability: 4.05484894e+02 -2.28810174e+01 2.81674058e+02 1.40650948e+01 1.40946676e+01 1.49940143e+02
1716.lowfreq: -4.9079 -0.0009 -0.0007 0.0004 3.9113 6.3179 13.0714 22.1337 38.4412
frequency: 12.9496 22.0415 38.4325 40.8190 43.6111 71.3572 82.6046 95.9030 101.1926 125.5093 131.8179 145.5408 155.1452 176.3559 180.7919 204.7950 220.3771 224.8884 229.6512 242.4782 250.1841 264.4671 294.4023 300.4539 327.5683 342.9155 350.7702 366.6336 402.3585 419.3476 433.9709 466.5711 472.4131 493.6932 505.3390 515.5965 545.2385 551.2915 575.8660 602.2106 615.0824 624.2157 634.0602 692.5163 714.9317 719.1779 735.5236 756.1646 756.6311 793.9568 796.1009 801.5497 817.5624 830.7866 871.2407 892.9729 902.0432 905.7558 908.4973 914.4684 921.2282 971.8232 980.7408 988.5195 992.5050 998.0019 1010.8184 1036.8493 1062.0626 1077.9421 1094.9764 1106.3705 1109.9328 1110.8097 1113.3813 1141.4482 1145.2989 1150.4091 1161.1540 1174.4131 1187.3640 1189.1481 1199.5291 1209.6900 1230.7745 1236.0788 1242.4842 1256.8523 1262.1935 1269.6089 1281.5346 1296.4079 1299.2227 1325.7833 1336.4513 1349.6095 1363.6792 1378.7960 1382.6216 1388.3403 1394.9609 1417.5025 1435.3122 1438.0949 1446.9937 1449.8144 1459.1389 1460.5829 1466.2590 1467.4072 1468.7723 1470.9299 1471.2146 1472.0660 1474.1545 1482.6150 1490.2100 1506.4106 1522.9510 1571.8901 1601.7263 1603.4870 1608.8725 1614.1288 2794.4871 2825.6260 2843.1416 2941.0035 2960.6758 2965.2356 2978.4463 2983.4578 2994.1555 3003.3614 3022.9748 3031.7615 3034.8714 3049.7558 3055.3326 3071.3827 3090.2610 3117.2081 3119.9592 3130.0314 3130.3156 3148.0740 3164.3442 3168.3177 3196.7009 3552.7391
redmass: 3.9251 4.0466 4.1916 4.5689 3.6293 4.9433 3.6430 3.0325 2.7507 3.6533 4.0379 3.7819 2.9501 1.8851 2.4150 2.6924 3.0960 1.8988 2.6685 1.3727 2.5350 1.4459 3.3898 4.3420 2.6324 2.2131 4.2699 3.8964 3.9926 3.8269 4.9465 3.4241 3.3142 3.5293 3.9723 4.7099 4.3101 3.8378 4.1784 3.8191 3.7527 5.3705 1.3990 5.2421 3.6236 2.6181 4.9536 3.0879 1.6630 1.6370 1.7047 2.8964 2.2909 4.5270 2.5513 3.2416 1.3750 1.4581 1.5488 1.3572 3.0454 3.2458 6.7232 2.0799 1.4424 2.7320 2.3240 1.9964 2.1665 2.1684 2.2975 2.1686 2.1195 1.2647 1.2624 2.2288 1.6479 1.7237 1.4184 1.5666 1.4916 1.7750 1.5839 1.9275 1.5459 1.8675 1.2246 1.5647 3.2644 1.2022 2.0613 1.9982 1.5988 1.4512 1.5459 1.3871 1.5411 2.4494 1.7402 3.3196 1.4220 4.1799 1.2267 1.6638 1.3563 1.4509 1.3635 1.3097 1.3661 1.0491 1.0514 1.0996 1.0637 1.0656 1.0697 1.1201 1.0670 2.6094 2.4336 6.3843 7.4396 6.8913 7.4470 3.9797 1.0713 1.0705 1.0705 1.0591 1.0329 1.0327 1.0396 1.0581 1.0991 1.0885 1.0867 1.0960 1.0892 1.1040 1.1041 1.0995 1.0998 1.0879 1.0889 1.0999 1.0995 1.0951 1.0927 1.0911 1.0948 1.0748
irintensity: 0.0515 0.2545 0.4361 0.9296 0.1708 1.3523 5.9467 9.3167 1.3106 2.8633 2.2060 0.7371 0.7484 1.0663 1.0607 7.6571 1.8330 2.2299 2.8499 2.5874 0.6334 2.4204 9.2317 8.8538 0.9373 2.5143 1.9146 3.9863 0.3470 1.1752 5.5996 1.4442 1.4967 4.5051 0.9235 1.9005 20.8102 10.5506 4.7607 3.8473 16.3265 3.9897 33.9578 7.5168 43.4690 2.4413 24.8744 4.4631 11.3061 78.9635 3.8124 10.4290 23.9025 13.2427 0.4733 4.5664 1.8441 24.1659 0.5219 5.4228 6.6947 4.5513 41.6620 6.5147 7.8797 63.4110 12.1317 11.5419 6.9467 29.8864 8.8177 12.2261 30.5624 0.2790 0.2536 43.7577 72.8658 57.7649 23.2467 2.2762 15.8383 32.9614 11.7144 66.1077 3.6099 36.9290 2.6254 8.4410 516.8675 7.2633 16.5969 57.8090 55.1619 1.0168 11.0059 28.2663 20.8021 124.3715 28.3838 54.9232 9.4552 3.0224 47.8780 45.0763 9.2950 107.9532 75.7749 50.9557 129.4394 11.2823 17.7748 45.1161 10.0787 37.5357 7.3033 16.4299 24.8602 273.2505 282.0892 119.0220 42.5638 124.2316 9.2602 33.4014 64.5874 52.5666 203.1861 48.0819 83.2342 44.5779 44.0927 28.9025 31.2352 17.6666 23.0147 19.4747 69.4143 44.1089 44.6486 57.6128 49.9661 9.8921 26.2549 8.9508 36.5133 29.9188 11.0041 7.3670 10.4236 15.7062
temp: 298.150 k
press: 1.00000 atm
elementType: 8 8 8 7 7 6 6 6 6 6 6 6 6 6 6 6 6 6 6 6 6 6 6 6 6 6 1 1 1 1 1 1 1 1 1 1 1 1 1 1 1 1 1 1 1 1 1 1 1 1 1 1
symmnumber: 1
zpe: 1129961.2 jmol-1
zpe.correction: 0.430379 hartree
zpe.thermalcorrener: 0.455801 hartree
zpe.thermalcorrenthalpy: 0.456745 hartree
zpe.thermalcorrgfe: 0.373016 hartree
zpe.sumelectzpe: -1149.060187 hartree
zpe.sumelectthermal: -1149.034765 hartree
zpe.sumelectthermalent: -1149.033821 hartree
zpe.sumelectthermalfe: -1149.117550 hartree
dipole: -0.9379 -4.5510 -0.8868
dipole: 4.7305
quadrupole: -139.2438 -140.5952 -158.7787
quadrupole: -4.1387 4.2201 8.5023
quadrupole: 6.9621 5.6107 -12.5728 -4.1387 4.2201 8.5023
hfenergy: -1149.4905662 hartree
pointgroup: C01 [X(C21H26N2O3)]
dipole: 0.3290711 -1.779015 0.4366242 debye
polarizability: 406.2477038|21.0118527|279.0862288|14.1222008|-20.4880682|151.7651616 unknown
InChI: InChI=1S/C21H26N2O3/c1-4-11-23-12-10-17-16(14-23)6-5-7-18(17)22-21(24)15-8-9-19(25-2)20(13-15)26-3/h5-9,13,22H,4,10-12,14H2,1-3H3
charge 0 multiplicity 1
52 atoms
O  -1.5035 2.606258 -0.099261
O  -6.145499 0.522725 -0.891184
O  -6.017003 -1.962196 0.010321
N  4.62894 -1.242397 0.135936
N  -0.070893 0.749987 0.103846
C  3.463202 -1.699908 0.921369
C  2.180869 -1.014842 0.411916
C  4.894259 0.189043 0.395435
C  2.350219 0.496018 0.287906
C  3.647671 1.06091 0.292691
C  5.82925 -2.091057 0.335635
C  1.214666 1.361022 0.156305
C  6.944179 -1.843263 -0.705783
C  3.811321 2.465583 0.205683
C  1.383821 2.766721 0.073757
C  2.686251 3.306952 0.107156
C  6.480736 -2.091686 -2.156226
C  -1.329599 1.351451 0.018541
C  -2.496592 0.400587 0.049746
C  -3.736097 0.905306 -0.427599
C  -2.440636 -0.921969 0.546052
C  -4.893159 0.107997 -0.435989
C  -3.597107 -1.734637 0.546629
C  -4.825205 -1.240392 0.053896
C  -6.252235 1.901217 -1.382227
C  -5.990071 -3.339646 0.510702
H  3.368918 -2.795351 0.808754
H  3.589852 -1.485945 2.015304
H  1.918318 -1.449673 -0.574669
H  1.360009 -1.264212 1.118804
H  5.3507 0.329567 1.414303
H  5.639321 0.553721 -0.334612
H  6.254502 -1.955936 1.365919
H  5.50355 -3.146875 0.255351
H  7.336496 -0.812074 -0.607624
H  7.790431 -2.514592 -0.45743
H  4.821484 2.892963 0.20938
H  0.503493 3.403436 -0.022398
H  2.816363 4.392695 0.040808
H  -0.070456 -0.270154 0.084789
H  7.287058 -1.869319 -2.878993
H  5.606477 -1.461568 -2.394909
H  6.177997 -3.146602 -2.297902
H  -3.748543 1.942424 -0.77465
H  -1.523146 -1.331739 0.985221
H  -3.536255 -2.750977 0.946107
H  -6.002508 2.630407 -0.587779
H  -5.594486 2.067358 -2.257057
H  -7.304977 2.014999 -1.678267
H  -7.017285 -3.708242 0.37797
H  -5.288432 -3.966278 -0.073609
H  -5.715971 -3.372317 1.583137
