program: Gaussian 09
title: 000211314
version: EM64L-G09RevD.01
frameworkgroup: C1[X(C9H8O3)]
method: RPBEPBE
basis: SDD
operation: Freq
keyword: #p
keyword: freq=noraman
keyword: PBEPBE/SDD
title: #p freq=noraman PBEPBE/SDD
converged: YES YES NO NO
title: Mulliken charges:
elementType: O O O C C C C C C C C C H H H H H H H H
charge: -0.257370 -0.214864 -0.228867 0.267378 0.083735 -0.324703 -0.328531 0.177340 -0.328661 -0.364391 -0.250302 -0.200994 0.233384 0.243418 0.241934 0.241662 0.277165 0.257700 0.237902 0.237064
chargesum: 0.00000
title: Mulliken charges with hydrogens summed into heavy atoms:
elementType: O O O C C C C C C C C C
charge: -0.257370 -0.214864 -0.228867 0.267378 0.083735 0.152099 0.155065 0.177340 -0.051496 -0.106691 -0.012399 0.036070
polarizability: 1.38100773e+02 4.28211250e+00 1.17013801e+02 2.73208717e+00 -1.55256903e+00 5.32716446e+01
1716.lowfreq: -9.4254 -0.0007 -0.0004 0.0005 4.2781 6.6639 61.6015 101.8289 135.2154
frequency: 61.5861 101.8247 135.2148 237.5655 258.4325 305.5753 373.9152 388.6723 433.7044 484.9111 517.6586 530.4750 576.7982 613.8057 658.0054 672.0238 747.0461 777.3957 785.0650 856.2982 876.6019 938.2414 974.1908 979.6287 993.7222 1035.7565 1047.0558 1067.4152 1080.7962 1106.5971 1167.2460 1177.6871 1201.5647 1223.6782 1269.1993 1275.8078 1353.5789 1363.0727 1389.4617 1424.6107 1450.1351 1455.9985 1467.0963 1567.4437 1606.9912 1627.1100 2996.7673 3011.4646 3091.4322 3102.6768 3140.8473 3156.0194 3169.2757 3179.1833
redmass: 4.7830 4.0061 4.3287 5.5002 3.0697 4.6303 6.3510 4.3998 3.8897 6.5592 3.6529 3.8106 3.3418 6.3204 6.1116 5.0417 3.6033 1.5469 4.2602 3.0342 1.4488 4.0166 1.3580 3.8012 1.3349 2.9932 2.2752 2.5934 3.5453 2.1283 1.3921 1.9742 1.1579 1.8627 1.3910 1.4356 1.4070 1.4959 3.8996 2.2633 1.1642 1.2198 1.7585 6.9738 7.8989 8.9175 1.0663 1.0627 1.1017 1.0998 1.0863 1.0899 1.0946 1.1006
irintensity: 8.3430 2.6072 2.3636 0.6398 2.3815 9.5933 3.7619 1.2257 0.9595 4.7501 3.7851 3.1921 6.0980 10.7575 3.2328 21.2653 32.6266 59.0005 9.8901 9.8085 1.7205 31.4564 3.1723 69.9598 0.6342 24.3739 22.2618 20.8959 9.8493 79.3667 31.0463 24.8357 11.4177 106.9945 210.1578 23.4661 15.9717 2.3792 3.0704 52.3587 5.1025 28.0162 64.7606 10.3245 169.1622 179.4816 35.6447 29.7950 12.6590 25.2773 5.0826 5.8504 5.8704 15.7108
temp: 298.150 k
press: 1.00000 atm
elementType: 8 8 8 6 6 6 6 6 6 6 6 6 1 1 1 1 1 1 1 1
symmnumber: 1
zpe: 397664.6 jmol-1
zpe.correction: 0.151462 hartree
zpe.thermalcorrener: 0.160910 hartree
zpe.thermalcorrenthalpy: 0.161854 hartree
zpe.thermalcorrgfe: 0.116348 hartree
zpe.sumelectzpe: -572.546915 hartree
zpe.sumelectthermal: -572.537467 hartree
zpe.sumelectthermalent: -572.536523 hartree
zpe.sumelectthermalfe: -572.582029 hartree
dipole: 0.6311 -4.1678 1.0903
dipole: 4.3541
quadrupole: -57.8399 -76.5048 -70.1550
quadrupole: 10.7246 -0.5165 1.7441
quadrupole: 10.3266 -8.3383 -1.9884 10.7246 -0.5165 1.7441
hfenergy: -572.698377 hartree
pointgroup: C01 [X(C9H8O3)]
dipole: 0.3310016 1.6400422 -0.3676158 debye
dipolederiv: -1.1552234 0.5273744 0.0935413 0.5730377 -0.7037119 -0.1215195 0.0962778 -0.0951102 -0.3278332 -1.0094106 0.4425273 -0.2490077 0.3369547 -0.6971909 0.1153351 -0.1961445 0.1511557 -0.4137076 -0.6315771 -0.0980648 -0.0297713 -0.1204405 -1.1282512 0.1890911 -0.0549528 0.1615988 -0.3976724 0.837539 -0.595347 -0.1064941 -0.4887045 0.6813542 0.1130098 -0.1412244 0.0880407 0.145494 -0.6454568 -0.2799446 -0.0361923 -0.0204107 -0.3583448 -0.0056825 0.0077242 0.0152121 -0.0858822 0.84332 -0.1961709 -0.080869 0.0669542 0.1574355 -0.0112742 -0.0498766 -0.0168395 0.2592906 0.1690855 -0.034172 0.0144497 -0.2728973 0.4724913 -0.119988 0.0060117 -0.0987653 0.2490693 1.7387212 -0.0644075 0.2952103 0.106268 1.4288922 -0.3183374 0.239278 -0.3052622 0.4304995 0.2189215 0.2055727 -0.0004127 -0.150454 0.0045252 0.0193532 0.0221342 0.0098528 -0.0962764 -0.4435062 0.2912097 0.0397721 0.0328288 0.0245989 0.0221586 0.0142282 -0.0022332 -0.1855129 -0.1127867 -0.2582615 -0.029087 -0.1428343 -0.1903365 0.0048202 -0.016803 0.0152724 -0.1833997 0.1752649 -0.0288925 -0.0259022 0.0135266 0.2562591 0.0334027 -0.02183 0.0428178 -0.1134642 -0.0051196 0.0635099 0.0000539 0.1067393 -0.0919847 -0.0057683 -0.0165208 0.012529 0.1110603 -0.0420077 0.0370695 0.0153145 -0.1072429 0.0779246 0.1015921 0.059517 0.0288016 -0.0807193 -0.1111382 0.0588335 -0.0560541 0.0280331 0.0506889 0.0164327 -0.0339019 0.0117315 0.1081571 0.080493 -0.0393576 0.1229521 0.0308491 -0.0289364 0.0309452 0.0605257 0.0394552 -0.0588852 0.1247554 -0.0405151 -0.0019511 0.0135753 0.0094068 -0.0189592 -0.0151876 -0.0044702 0.1518985 0.0941508 -0.0061288 0.0052627 -0.0292225 -0.0483831 -0.0209964 0.0093517 -0.025663 0.1670714 -0.0372832 0.0854271 0.0199841 0.0969539 0.0128911 -0.020089 0.0210297 -0.0258322 0.1671205 -0.0887418 -0.0702618 0.0092007 -0.0735142 0.0706717 -0.0035262 0.0103635 -0.0022919 0.1536921 unknown
polarizability: 137.7339636|-5.1602539|117.4812489|-1.5052591|0.6749872|53.1710058 unknown
InChI: InChI=1S/C9H8O3/c10-9-7-3-1-2-4-8(7)11-5-6-12-9/h1-4H,5-6H2
charge 0 multiplicity 1
20 atoms
O  -0.451445 1.926074 0.292147
O  -2.3133 -0.678789 -0.364071
O  -1.147688 -2.495075 0.300305
C  0.468215 0.884461 0.101527
C  0.208384 -0.519307 -0.019413
C  -1.889719 1.646591 0.379465
C  -2.375444 0.741587 -0.750064
C  -1.094553 -1.280382 0.00747
C  1.346114 -1.380586 -0.153038
C  1.802929 1.371993 0.057049
C  2.659668 -0.896792 -0.201517
C  2.88842 0.499195 -0.098438
H  -2.350825 2.646056 0.322459
H  -2.132557 1.189276 1.359055
H  -3.445475 0.906798 -0.953018
H  -1.797059 0.924159 -1.67597
H  1.1446 -2.454522 -0.212011
H  1.946041 2.451795 0.15805
H  3.496549 -1.59219 -0.316473
H  3.906942 0.900457 -0.131213
