program: Gaussian 09
title: 000211313
version: EM64L-G09RevD.01
frameworkgroup: C1[X(C10H19ClO2)]
method: RPBEPBE
basis: SDD
operation: Freq
keyword: #p
keyword: freq=noraman
keyword: PBEPBE/SDD
title: #p freq=noraman PBEPBE/SDD
converged: YES YES NO NO
title: Mulliken charges:
elementType: Cl O O C C C C C C C C C C H H H H H H H H H H H H H H H H H H H
charge: -0.054265 -0.267622 -0.243095 -0.130397 -0.405657 -0.407408 -0.361779 -0.358387 0.221505 -0.699022 -0.697403 -0.235011 -0.555614 0.225975 0.195591 0.217024 0.197638 0.218331 0.193176 0.228645 0.196569 0.211246 0.204667 0.219519 0.214090 0.215740 0.216535 0.208384 0.225448 0.269228 0.258181 0.278169
chargesum: 0.00000
title: Mulliken charges with hydrogens summed into heavy atoms:
elementType: Cl O O C C C C C C C C C C
charge: -0.054265 -0.267622 -0.243095 0.095577 0.006957 0.008561 0.060042 0.049428 0.221505 -0.060747 -0.056744 0.259666 -0.019263
polarizability: 1.36773381e+02 3.73665571e+00 1.32447357e+02 -1.02115220e+00 3.60616715e+00 9.96848881e+01
1716.lowfreq: -12.5446 -1.9945 -0.0011 -0.0005 0.0017 8.4168 21.0628 28.0442 49.7689
frequency: 19.8553 27.3780 49.7609 57.7428 67.1091 74.3985 85.6976 86.1462 148.2537 178.3509 206.6921 228.3005 232.4509 256.3018 262.8047 287.9549 312.7205 327.4958 426.4261 475.2710 493.9652 605.5339 633.9249 707.4959 742.3276 745.3766 780.4582 837.7711 857.8307 873.7565 909.1520 916.1303 935.8363 984.8221 1006.9311 1025.0768 1056.4367 1065.6393 1072.2605 1084.0092 1087.9268 1113.5505 1126.2646 1141.8501 1181.9359 1219.8894 1223.3139 1230.5122 1252.7293 1286.6346 1291.1810 1297.8383 1300.4873 1314.1279 1339.7357 1346.1057 1357.3576 1368.9159 1388.1185 1389.1287 1432.5796 1455.7523 1459.8046 1463.7459 1471.4152 1472.9819 1477.3959 1477.6128 1485.2211 1486.1766 1646.4937 2967.7841 2969.8517 2972.2248 2973.6429 2977.1442 2980.1813 2996.5697 3009.7128 3013.2766 3022.4394 3040.9280 3050.5598 3059.5748 3069.0834 3070.5658 3073.8426 3074.0829 3080.6395 3144.6178
redmass: 5.4978 7.0035 7.6884 3.2280 1.5827 1.6061 4.6758 3.2412 3.0033 2.8500 4.1580 1.1414 1.1363 2.4981 2.8969 3.3250 3.2798 4.2797 2.9416 3.4565 3.0994 4.8824 2.7543 2.2496 1.4249 1.3576 2.4450 2.7140 1.2826 2.0878 1.5410 1.5042 2.1581 1.9529 3.6889 1.8022 2.4319 1.7464 2.5534 2.9798 2.3512 2.1829 1.8688 2.5470 1.2892 1.3808 1.1499 1.3501 1.2160 1.2097 1.1001 1.2042 1.1956 1.2953 1.3382 1.5212 1.5076 1.5298 1.2119 1.2127 1.1040 1.0762 1.0816 1.0770 1.0668 1.0637 1.0434 1.0444 1.0751 1.0741 8.9889 1.0579 1.0535 1.0415 1.0378 1.0608 1.0594 1.0608 1.0956 1.0958 1.0923 1.1035 1.1001 1.0597 1.1009 1.1006 1.0996 1.0994 1.1001 1.1097
irintensity: 1.0169 0.8700 1.2259 0.6152 0.0210 0.0687 1.7695 0.5587 2.2409 2.9681 2.3257 0.0206 0.0050 1.0100 0.5624 0.5113 7.2304 10.9476 8.1121 2.2426 6.0148 23.2344 0.5278 2.8543 8.3752 14.1430 4.5846 9.8871 0.9617 3.0833 3.0529 3.4094 19.5332 9.3762 28.0755 1.4903 1.8807 17.4711 46.1180 135.6926 136.7943 0.4461 45.3801 10.9518 0.6785 0.5115 1.4841 8.5098 1.9532 0.8417 0.3955 16.0672 7.9614 0.4039 9.9734 0.7424 6.5437 22.2409 11.2075 8.4837 10.1451 0.4259 21.1442 2.2537 3.4627 7.8782 0.1033 23.9712 7.2405 25.3070 130.2218 16.5700 11.7353 32.7670 26.3214 2.7110 116.4020 28.3034 3.9370 2.4367 7.0886 0.0182 28.0724 24.7317 43.3612 110.0167 36.8494 68.1501 6.2790 9.3550
temp: 298.150 k
press: 1.00000 atm
elementType: 17 8 8 6 6 6 6 6 6 6 6 6 6 1 1 1 1 1 1 1 1 1 1 1 1 1 1 1 1 1 1 1
symmnumber: 1
zpe: 719430.3 jmol-1
zpe.correction: 0.274017 hartree
zpe.thermalcorrener: 0.290730 hartree
zpe.thermalcorrenthalpy: 0.291674 hartree
zpe.thermalcorrgfe: 0.226559 hartree
zpe.sumelectzpe: -1001.910126 hartree
zpe.sumelectthermal: -1001.893413 hartree
zpe.sumelectthermalent: -1001.892468 hartree
zpe.sumelectthermalfe: -1001.957584 hartree
dipole: -0.7623 -1.8532 -2.0819
dipole: 2.8896
quadrupole: -89.5020 -77.3790 -92.2993
quadrupole: -7.3047 0.3450 1.2229
quadrupole: -3.1086 9.0144 -5.9059 -7.3047 0.3450 1.2229
hfenergy: -1002.1841429 hartree
pointgroup: C01 [X(C10H19Cl1O2)]
dipole: -0.0114026 0.8611492 -0.7421218 debye
polarizability: 134.4006761|4.0981709|135.2032365|-1.4909971|-0.1289566|99.3017135 unknown
InChI: InChI=1S/C10H19ClO2/c1-3-5-9(6-4-2)10(12)13-8-7-11/h9H,3-8H2,1-2H3
charge 0 multiplicity 1
32 atoms
Cl -3.832497 -0.713561 0.459897
O  -1.047728 0.934332 -0.154331
O  0.080742 0.373058 1.814511
C  1.039655 -0.27246 -0.372946
C  1.077943 -1.812018 -0.140194
C  2.434249 0.370483 -0.129706
C  -0.234404 -2.539613 -0.508519
C  2.496276 1.881325 -0.448925
C  0.017125 0.354367 0.565358
C  -0.132873 -4.065785 -0.300073
C  3.910849 2.466384 -0.248315
C  -2.146686 1.543233 0.632946
C  -3.476803 1.094971 0.0532
H  0.714769 -0.069237 -1.410678
H  1.9093 -2.225155 -0.746853
H  1.328276 -2.002766 0.922418
H  3.171494 -0.166863 -0.75965
H  2.725361 0.200817 0.925713
H  -0.489162 -2.323447 -1.565961
H  -1.071053 -2.139937 0.096993
H  2.166372 2.050542 -1.494078
H  1.780552 2.426771 0.198441
H  0.67299 -4.501814 -0.921066
H  -1.078194 -4.571495 -0.568686
H  0.090092 -4.306324 0.756518
H  4.246757 2.337316 0.797595
H  3.938285 3.546683 -0.481075
H  4.646671 1.960909 -0.902123
H  -2.054195 2.641292 0.520491
H  -2.032798 1.274849 1.697637
H  -4.309756 1.666709 0.49102
H  -3.49081 1.160932 -1.04426
