program: Gaussian 09
title: 000211312
version: EM64L-G09RevD.01
frameworkgroup: C1[X(C12H12BrNO2)]
method: RPBEPBE
basis: SDD
operation: Freq
keyword: #p
keyword: freq=noraman
keyword: PBEPBE/SDD
title: #p freq=noraman PBEPBE/SDD
converged: YES YES NO NO
title: Mulliken charges:
elementType: Br O O N C C C C C C C C C C C C H H H H H H H H H H H H
charge: 0.005013 -0.192088 -0.206562 -0.162031 -0.377885 -0.572912 0.154857 0.175932 0.553855 -0.329856 -0.325977 -0.438028 -0.660953 -0.200196 -0.205396 -0.214041 0.269958 0.272753 0.280306 0.244209 0.243593 0.253609 0.238671 0.240166 0.235914 0.224742 0.237296 0.255049
chargesum: 0.00000
title: Mulliken charges with hydrogens summed into heavy atoms:
elementType: Br O O N C C C C C C C C C C C C
charge: 0.005013 -0.192088 -0.206562 -0.162031 -0.107927 -0.019853 0.154857 0.175932 0.553855 0.157946 -0.072367 -0.199358 0.039870 -0.200196 0.031900 0.041008
polarizability: 1.74976538e+02 2.46415707e+00 1.67358265e+02 -1.01518948e+01 -1.06476863e+01 1.12496566e+02
1716.lowfreq: -0.0007 -0.0004 0.0003 3.3733 4.5876 7.4961 12.5930 20.6479 32.3501
frequency: 11.7634 20.3173 32.3221 59.6984 97.4426 134.9875 147.4537 170.1925 191.4604 234.3825 279.0492 289.6212 295.5025 314.5740 342.6954 418.0256 434.7885 516.7903 526.9428 555.6087 580.2047 611.9223 632.2004 663.6574 678.3130 696.1284 752.0056 780.6061 805.6864 815.6112 892.5072 911.2764 937.9053 960.8779 969.6391 981.9795 983.9704 1036.4596 1060.7199 1070.4180 1095.6511 1097.2135 1119.6874 1153.9153 1181.5498 1206.9210 1217.1074 1223.1169 1270.0525 1274.4254 1315.1509 1331.0401 1340.6548 1367.6441 1376.6347 1390.8175 1421.7382 1450.1407 1455.5333 1463.2548 1471.3186 1481.3955 1573.9288 1602.3968 1628.6483 1693.7007 2994.1954 3025.6294 3027.5449 3036.1439 3082.1616 3088.9947 3094.2873 3108.1575 3135.3868 3145.8251 3155.3974 3177.8522
redmass: 6.3294 5.3402 2.7199 5.3350 8.4103 4.5441 4.7329 4.5038 1.2100 4.9005 3.8970 2.0882 7.5734 5.5468 6.4017 3.7693 3.0474 5.0221 6.0581 3.0817 6.1709 4.2279 5.9291 5.4940 5.1281 2.3452 2.3548 1.3550 1.7771 3.4662 1.5361 1.4116 2.6265 2.5514 2.4651 1.6955 3.1506 2.9269 5.0318 2.1904 1.6195 2.0278 2.7942 1.2138 1.1032 1.8265 2.1302 1.4540 1.4273 1.5404 1.4967 3.2399 1.3977 1.5827 7.2968 1.2331 2.2876 1.1264 1.1064 2.2349 1.0420 1.0523 6.3508 6.7640 12.0600 11.2891 1.0352 1.0592 1.0689 1.0773 1.1034 1.1012 1.0992 1.1042 1.0878 1.0921 1.0936 1.0977
irintensity: 0.1602 0.1424 0.1746 0.7533 4.7471 5.4601 1.6025 0.6234 1.1493 1.4301 2.4206 3.5660 2.5454 3.4636 16.1433 4.5501 7.8771 1.2359 2.8612 1.2899 3.8773 0.7512 10.6532 20.9806 13.4294 36.6378 12.7482 12.8114 38.0769 40.5802 8.5085 0.4133 27.5666 1.6616 10.6237 2.1228 6.0917 8.5296 18.7889 19.3127 4.4020 5.1334 95.2482 6.3338 1.6062 20.2310 73.2375 24.0479 2.5531 3.4949 3.7109 173.6938 47.0557 51.0057 1.2740 10.9123 26.0814 10.8989 38.6648 31.3924 21.6874 10.6422 48.4015 31.1035 541.9055 34.9934 15.5526 18.4917 7.3803 6.7123 1.6617 4.3651 38.8593 16.0797 5.0051 6.0024 10.9107 7.3826
temp: 298.150 k
press: 1.00000 atm
elementType: 35 8 8 7 6 6 6 6 6 6 6 6 6 6 6 6 1 1 1 1 1 1 1 1 1 1 1 1
symmnumber: 1
zpe: 563267.2 jmol-1
zpe.correction: 0.214537 hartree
zpe.thermalcorrener: 0.229724 hartree
zpe.thermalcorrenthalpy: 0.230668 hartree
zpe.thermalcorrgfe: 0.167938 hartree
zpe.sumelectzpe: -682.009618 hartree
zpe.sumelectthermal: -681.994431 hartree
zpe.sumelectthermalent: -681.993487 hartree
zpe.sumelectthermalfe: -682.056218 hartree
dipole: 0.1011 2.3613 0.3943
dipole: 2.3961
quadrupole: -101.9564 -95.6660 -112.7620
quadrupole: 2.7369 2.5994 9.6038
quadrupole: 1.5050 7.7955 -9.3005 2.7369 2.5994 9.6038
hfenergy: -682.2241554 hartree
pointgroup: C01 [X(C12H12Br1N1O2)]
dipole: -0.3208468 -0.8864031 0.005316 debye
polarizability: 176.4666408|-2.0009209|162.3585215|10.7034223|16.2900094|116.0062061 unknown
InChI: InChI=1S/C12H12BrNO2/c1-2-14-11(15)7-10(12(14)16)8-4-3-5-9(13)6-8/h3-6,10H,2,7H2,1H3
charge 0 multiplicity 1
28 atoms
Br -3.092469 2.944172 0.717742
O  1.053937 -0.900876 -2.058921
O  3.115626 0.328733 1.963366
N  2.284862 -0.116613 -0.202582
C  0.277856 -1.340384 0.293492
C  1.01023 -0.980411 1.616148
C  1.205372 -0.78506 -0.821433
C  2.251956 -0.181057 1.211402
C  -1.141079 -0.791151 0.151046
C  3.346144 0.578994 -0.958164
C  -1.418304 0.567805 0.454374
C  -2.188257 -1.62053 -0.315613
C  2.978884 2.047997 -1.249054
C  -2.726785 1.059211 0.294573
C  -3.495241 -1.107728 -0.469504
C  -3.780765 0.242172 -0.163553
H  0.237095 -2.435177 0.151163
H  1.332417 -1.874816 2.176862
H  0.39225 -0.378239 2.302934
H  4.266065 0.520736 -0.351013
H  3.49298 0.022302 -1.899965
H  -0.624319 1.235678 0.805273
H  -1.980048 -2.666808 -0.565584
H  2.054175 2.111584 -1.848126
H  2.839514 2.612573 -0.311018
H  3.792072 2.528992 -1.821238
H  -4.300459 -1.756622 -0.829541
H  -4.791008 0.643826 -0.280364
