program: Gaussian 09
title: 000211304
version: EM64L-G09RevD.01
frameworkgroup: C1[X(C15H17N3OS)]
method: RPBEPBE
basis: SDD
operation: Freq
keyword: #p
keyword: freq=noraman
keyword: PBEPBE/SDD
title: #p freq=noraman PBEPBE/SDD
converged: NO YES NO NO
title: Mulliken charges:
elementType: S O N N N C C C C C C C C C C C C C C C H H H H H H H H H H H H H H H H H
charge: 0.328573 -0.195058 -0.080385 -0.249571 0.007903 -0.358010 -0.371012 -0.315979 -0.393708 -0.388944 -0.398828 -0.596148 0.195756 -0.218543 0.358051 0.004414 -0.350835 -0.337433 -0.209317 -0.222824 0.204386 0.185091 0.176335 0.220625 0.237726 0.238222 0.209099 0.196821 0.196795 0.210097 0.190868 0.219342 0.311950 0.278681 0.255873 0.229506 0.230482
chargesum: 0.00000
title: Mulliken charges with hydrogens summed into heavy atoms:
elementType: S O N N N C C C C C C C C C C C C C C C
charge: 0.328573 -0.195058 -0.080385 -0.249571 0.007903 0.031467 0.025948 0.159969 0.012212 0.017948 0.011383 -0.284199 0.195756 -0.218543 0.358051 0.004414 -0.072154 -0.081560 0.020189 0.007658
polarizability: 3.24210359e+02 -2.25652133e+00 1.86881565e+02 1.21022467e+01 2.77288200e+00 1.17726855e+02
1716.lowfreq: -20.8376 -4.6601 0.0004 0.0008 0.0009 3.5949 18.3773 23.1542 36.1297
frequency: 10.2941 23.0483 36.1185 90.6579 100.1006 117.6972 127.7332 156.0847 200.0351 234.7406 261.2369 269.0304 307.9175 343.7325 358.5899 370.9381 389.7858 401.7949 433.6769 434.8728 448.1953 478.4467 540.6367 545.9435 567.4430 579.8520 623.0691 642.5636 652.5098 693.7369 726.6982 761.7025 769.0894 779.4457 804.9172 818.7070 852.4737 853.9157 876.3353 894.1628 899.2013 950.0603 956.3870 968.2773 984.7903 985.0466 995.9033 1009.7077 1042.2569 1052.5656 1080.3093 1090.3129 1104.7111 1119.0608 1147.9254 1151.1504 1155.1639 1156.9724 1162.6719 1189.4256 1202.9374 1213.1751 1257.4097 1260.7849 1266.1861 1281.8380 1289.7447 1295.8967 1329.3698 1339.4313 1341.7621 1350.1370 1354.9445 1367.6164 1386.9949 1392.0196 1438.9014 1453.1884 1455.4599 1461.4301 1463.0683 1465.9081 1469.8690 1480.2476 1480.5535 1596.8398 1618.3920 1636.8246 2841.2522 2848.8141 2894.4112 2969.3353 2988.6771 2990.1007 3017.9255 3031.3887 3039.8027 3041.2677 3050.7772 3057.3892 3059.3367 3138.1928 3156.7224 3174.9441 3183.9909
redmass: 4.7733 4.9536 3.7593 3.7712 5.4765 6.7282 5.1350 4.6583 7.9145 1.8305 3.2430 4.2598 6.0395 2.4658 4.6511 2.3539 8.2891 2.8488 3.1896 3.7142 2.8442 9.8020 2.2879 3.6533 7.1564 4.0507 6.7569 6.8462 6.6430 4.3597 4.8060 2.2479 1.8495 4.6673 1.4846 6.2400 1.5286 2.4372 1.4123 5.6384 2.6924 1.3825 1.3602 1.6574 1.4591 3.1876 2.7873 2.2206 2.7978 2.3842 1.6814 2.3503 2.2214 2.5230 1.2742 1.6345 1.3842 1.4858 2.2679 3.0953 1.7772 2.8588 1.3066 1.4721 1.1972 1.2822 1.5223 1.4177 1.2697 1.4181 1.4688 1.5173 3.9471 1.5534 1.3731 3.8021 3.3817 1.0872 1.0898 1.0873 2.8854 1.0977 1.0795 1.1185 9.6639 7.1127 8.7340 11.2271 1.0711 1.0699 1.0691 1.0634 1.0623 1.0610 1.0868 1.0898 1.0949 1.0861 1.1034 1.0883 1.1037 1.0864 1.0918 1.0961 1.0982
irintensity: 0.1041 0.6005 0.0896 0.6979 2.0249 0.4157 3.2482 1.5271 6.8641 0.1284 1.1911 2.0289 0.9576 1.5289 2.5978 7.5996 0.5728 6.2742 5.5567 1.6032 0.3837 0.9572 6.9036 18.6588 4.7329 3.4539 2.0528 0.5285 5.7972 4.9862 3.3914 39.2198 58.6891 9.7753 0.0816 5.0406 3.8762 11.2847 0.0357 3.6409 1.4789 5.2985 8.3415 7.9777 3.5163 20.6001 21.6661 8.5966 2.0749 8.6009 10.7111 37.0546 55.5356 7.1622 24.5518 44.3431 4.5032 31.6110 24.6426 97.4509 20.6298 4.3483 7.9867 6.6647 4.2282 18.3327 14.3952 10.7717 19.7803 30.9530 16.0237 8.2426 97.4118 3.4916 0.0794 41.0044 178.1172 10.5614 4.9010 11.6573 50.9870 17.3894 3.7590 17.4150 350.8498 2.0240 95.7412 119.8316 43.0070 162.3057 46.0551 41.4299 27.4136 29.8178 68.9197 43.4619 49.5596 4.1598 20.9646 13.0173 90.7819 4.3369 18.8533 11.3487 7.5337
temp: 298.150 k
press: 1.00000 atm
elementType: 16 8 7 7 7 6 6 6 6 6 6 6 6 6 6 6 6 6 6 6 1 1 1 1 1 1 1 1 1 1 1 1 1 1 1 1 1
symmnumber: 1
zpe: 778859.2 jmol-1
zpe.correction: 0.296652 hartree
zpe.thermalcorrener: 0.313707 hartree
zpe.thermalcorrenthalpy: 0.314651 hartree
zpe.thermalcorrgfe: 0.249311 hartree
zpe.sumelectzpe: -1217.879039 hartree
zpe.sumelectthermal: -1217.861983 hartree
zpe.sumelectthermalent: -1217.861039 hartree
zpe.sumelectthermalfe: -1217.926379 hartree
dipole: -2.4417 1.4637 0.5819
dipole: 2.9057
quadrupole: -102.5195 -135.6214 -124.8612
quadrupole: 1.1902 1.2127 -1.3003
quadrupole: 18.4812 -14.6207 -3.8605 1.1902 1.2127 -1.3003
hfenergy: -1218.1756906 hartree
pointgroup: C01 [X(C15H17N3O1S1)]
dipole: 0.9561511 0.6261241 -0.0248956 debye
polarizability: 323.9244917|-0.7716072|181.6598466|14.3603075|18.5397917|123.2344402 unknown
InChI: InChI=1S/C15H17N3OS/c19-14-13(10-17-8-4-1-5-9-17)20-15-16-11-6-2-3-7-12(11)18(14)15/h2-3,6-7,13H,1,4-5,8-10H2
charge 0 multiplicity 1
37 atoms
S  0.58043 -1.576254 0.034056
O  -0.617814 2.206951 0.858014
N  3.228169 0.224565 -0.17277
N  -1.512837 0.122559 0.2060
N  -2.223905 -1.973942 -0.438219
C  4.000309 0.644618 1.025999
C  4.048625 0.278684 -1.4123
C  1.931479 0.915828 -0.294037
C  5.246413 -0.243001 1.221964
C  5.294059 -0.621772 -1.282681
C  6.131079 -0.227135 -0.044891
C  0.864531 0.24141 0.597096
C  -0.480359 0.98884 0.581699
C  -1.182514 -1.233511 -0.099798
C  -2.914957 0.240594 0.039699
C  -3.338653 -1.073406 -0.360386
C  -3.801018 1.317513 0.196491
C  -4.700774 -1.320593 -0.615085
C  -5.166711 1.048398 -0.063245
C  -5.606111 -0.243772 -0.460984
H  3.348195 0.576559 1.917234
H  4.317954 1.716267 0.934832
H  4.376452 1.327682 -1.634816
H  3.420692 -0.060753 -2.256498
H  1.979537 1.992795 -0.001412
H  1.595401 0.872349 -1.345472
H  4.917083 -1.278771 1.43181
H  5.815298 0.114132 2.101589
H  5.898649 -0.543294 -2.206338
H  4.961706 -1.673241 -1.186097
H  6.548179 0.791022 -0.190546
H  6.990078 -0.913415 0.075386
H  1.220416 0.185958 1.640773
H  -3.452557 2.307296 0.501801
H  -5.035804 -2.3157 -0.92072
H  -5.899832 1.854779 0.044688
H  -6.671888 -0.408741 -0.652339
