program: Gaussian 09
title: 000211298
version: EM64L-G09RevD.01
frameworkgroup: C1[X(C20H32Cl2N2O2)]
method: RPBEPBE
basis: SDD
operation: Freq
keyword: #p
keyword: freq=noraman
keyword: PBEPBE/SDD
title: #p freq=noraman PBEPBE/SDD
converged: NO YES NO NO
title: Mulliken charges:
elementType: Cl Cl O O N N C C C C C C C C C C C C C C C C C C C C H H H H H H H H H H H H H H H H H H H H H H H H H H H H H H H H
charge: -0.024922 -0.051984 -0.443270 -0.275778 -0.078098 -0.126063 -0.351908 -0.367592 -0.353152 -0.397405 -0.388879 -0.398429 -0.375076 -0.418835 -0.367799 -0.088271 -0.362138 -0.332292 -0.337370 -0.691531 0.462923 -0.299151 -0.315455 -0.199180 -0.228668 -0.109252 0.198268 0.170556 0.167284 0.216879 0.232219 0.178335 0.203710 0.189188 0.191208 0.201458 0.212324 0.188696 0.205928 0.210296 0.227906 0.225300 0.202766 0.196349 0.223461 0.190854 0.193112 0.181611 0.212054 0.233150 0.245434 0.216121 0.206764 0.209535 0.352652 0.296014 0.281480 0.258663
chargesum: 0.00000
title: Mulliken charges with hydrogens summed into heavy atoms:
elementType: Cl Cl O O N N C C C C C C C C C C C C C C C C C C C C
charge: -0.024922 -0.051984 -0.090618 -0.275778 -0.078098 -0.126063 0.016916 0.016570 0.057402 -0.004507 0.003788 0.002591 0.041148 0.034371 0.031317 0.135190 0.021827 0.061373 0.141215 -0.059110 0.462923 -0.299151 -0.019441 0.082299 0.029995 -0.109252
polarizability: 3.32431796e+02 3.41209753e+00 2.72681577e+02 -4.27457780e+00 5.81062236e+00 1.77530955e+02
1716.lowfreq: -5.9894 -2.8409 -0.0008 -0.0006 0.0008 3.1211 14.3614 15.7881 17.4641
frequency: 13.9152 15.4852 17.4012 19.9369 25.3764 35.2335 46.3613 53.4794 63.1907 72.2114 83.6471 101.3271 117.8010 138.2828 152.6121 164.5576 175.7751 189.1180 200.9280 223.7904 230.8250 232.8817 249.6314 271.6503 287.1249 304.1087 312.2999 320.2767 333.9730 364.6968 370.2524 380.4217 384.7865 392.9738 405.1650 424.0488 441.2784 446.5386 461.1833 482.0905 504.0950 545.3880 554.5154 571.9891 601.2998 635.1408 685.0783 700.8301 734.3578 755.0378 776.5360 782.4130 799.2895 804.3778 808.9774 816.1699 821.0524 852.7215 855.8797 860.8201 879.6828 906.7502 908.9815 933.9326 938.8542 944.1040 956.2208 968.2882 990.5026 998.3295 1025.9667 1034.7363 1047.3986 1048.4749 1056.0502 1069.1424 1081.0740 1083.7613 1094.7014 1107.1769 1113.0411 1118.3279 1121.9810 1139.9249 1147.9644 1152.4013 1157.6387 1166.2190 1203.7146 1221.2935 1222.9953 1230.1086 1247.4316 1249.5862 1255.4428 1260.2505 1261.5252 1264.6857 1270.5162 1284.3021 1288.7627 1297.3221 1301.7399 1325.2973 1327.4332 1333.9077 1340.8175 1347.4023 1349.6336 1351.1556 1353.8989 1356.2790 1359.1839 1367.9881 1373.9635 1375.4196 1386.4900 1388.6779 1397.7117 1450.6543 1455.2149 1458.5501 1459.2588 1461.5444 1462.3690 1465.4802 1469.7085 1471.0541 1474.3402 1474.6264 1477.2905 1478.6869 1485.0199 1488.8388 1566.1364 1591.5462 2814.0119 2828.0666 2864.2762 2866.7104 2906.9006 2914.9283 2961.9775 2965.8107 2969.6840 2971.7498 2984.0204 2984.2867 3002.8058 3016.1902 3016.6548 3024.4445 3025.7458 3027.7067 3029.0750 3034.8130 3035.0949 3044.2586 3045.0147 3051.7230 3053.5907 3068.2314 3071.0996 3094.3227 3155.4457 3176.6136 3181.2870 3543.3737
redmass: 4.7475 4.5665 4.6219 4.3099 5.4471 4.6836 4.2031 4.0193 2.5474 2.7646 3.7922 5.4377 2.4906 5.0750 8.0993 6.0316 3.4795 8.5781 2.8995 1.4622 3.0724 1.6664 2.0983 2.9369 2.8681 2.3908 2.8675 3.1854 6.1905 4.8223 1.8087 1.4482 3.3290 3.3076 2.6518 2.7379 3.1984 2.7430 2.4852 2.6042 4.7412 4.1548 2.5293 2.2404 4.1077 5.0900 5.4967 4.3785 1.4188 2.3298 4.6093 1.2844 2.1254 1.5952 1.6686 1.8584 2.5013 1.4739 2.5293 1.3824 1.6797 2.5518 2.3160 1.4839 2.2963 1.4579 1.3056 2.6016 2.4257 2.1563 4.0708 2.7655 2.2077 2.1047 2.1599 2.2527 1.9921 2.3966 1.8515 2.2630 1.9034 2.1869 2.4361 1.5315 1.3519 1.4471 2.2375 1.7108 1.5551 2.4165 1.3395 1.7014 1.3641 1.3826 1.4137 1.4210 1.2872 1.1988 1.2943 1.1894 1.2615 1.3331 1.3109 1.4738 1.2755 1.3962 1.4641 1.5151 1.2909 1.5054 3.1213 1.4480 1.4566 1.3396 1.3868 1.3448 4.9032 1.2152 1.3771 1.0926 1.1675 1.3184 1.0923 1.1171 1.5276 1.0905 1.0890 1.0836 1.0877 1.0582 1.0444 1.0933 1.0817 1.0848 7.8729 7.4231 1.0716 1.0703 1.0700 1.0705 1.0695 1.0689 1.0616 1.0621 1.0575 1.0400 1.0607 1.0620 1.0926 1.0905 1.0628 1.0884 1.0870 1.0869 1.0905 1.0921 1.1001 1.1031 1.0879 1.0910 1.1036 1.1007 1.0991 1.1071 1.0890 1.0962 1.0938 1.0657
irintensity: 0.1700 0.0961 0.0165 0.1166 0.1210 0.0297 0.5069 0.5789 0.0515 0.6726 0.9499 0.6731 0.2580 0.4280 1.1887 0.1815 1.5181 1.0335 0.8967 1.0846 8.2879 0.2260 0.2419 2.3521 1.8900 4.7143 0.2192 2.3933 8.5871 6.3637 37.5289 127.6022 28.4179 21.1906 31.3018 9.4298 2.8580 2.5270 2.8581 1.9526 4.3176 4.8384 6.0972 0.7342 26.3063 13.1291 36.5848 9.6781 8.7975 13.3835 40.4998 6.8268 6.4622 1.1290 20.5494 9.7224 11.9037 3.5308 6.8980 21.7439 1.4948 23.5291 6.7632 11.8840 38.7941 19.1133 2.4251 20.8004 5.7155 25.1919 64.1024 6.9902 33.8872 18.9508 8.7056 43.7125 8.3637 57.5798 7.1011 62.0342 9.3165 4.6647 8.1568 9.0293 13.0632 4.9805 34.6802 7.5129 5.0495 117.5829 8.6137 25.6756 7.8718 20.8512 85.9593 24.8369 4.6761 25.8199 16.4509 4.4462 3.8631 5.9573 2.0879 7.5867 10.0055 2.8150 0.2730 2.3033 9.5997 1.8623 22.4395 0.7610 6.7947 8.4771 7.7128 3.9006 3.6556 10.8274 0.3326 7.2891 71.3791 121.1192 9.8044 9.5336 145.5324 8.0401 8.3611 7.2088 4.7940 2.7185 9.9755 2.8774 0.1188 28.3736 16.5938 7.5803 60.0828 101.4618 106.1999 78.6713 43.4150 144.6792 11.9987 38.7038 46.6585 68.2782 36.9157 37.0612 8.8725 23.2301 20.6002 13.2513 55.9381 21.3327 56.0767 14.4732 39.6142 18.2083 49.4875 78.7186 98.5300 91.2005 48.0158 6.9952 1.1915 0.9223 0.4039 7.0116
temp: 298.150 k
press: 1.00000 atm
elementType: 17 17 8 8 7 7 6 6 6 6 6 6 6 6 6 6 6 6 6 6 6 6 6 6 6 6 1 1 1 1 1 1 1 1 1 1 1 1 1 1 1 1 1 1 1 1 1 1 1 1 1 1 1 1 1 1 1 1
symmnumber: 1
zpe: 1287058.6 jmol-1
zpe.correction: 0.490215 hartree
zpe.thermalcorrener: 0.518947 hartree
zpe.thermalcorrenthalpy: 0.519891 hartree
zpe.thermalcorrgfe: 0.425266 hartree
zpe.sumelectzpe: -1959.296317 hartree
zpe.sumelectthermal: -1959.267585 hartree
zpe.sumelectthermalent: -1959.266641 hartree
zpe.sumelectthermalfe: -1959.361266 hartree
dipole: -2.4893 -1.6099 0.2774
dipole: 2.9775
quadrupole: -180.5910 -169.3108 -175.2038
quadrupole: -0.0522 -1.1499 -1.6844
quadrupole: -5.5558 5.7244 -0.1686 -0.0522 -1.1499 -1.6844
hfenergy: -1959.7865316 hartree
pointgroup: C01 [X(C20H32Cl2N2O2)]
dipole: -0.2984481 0.9462853 -0.6226807 debye
polarizability: 276.854378|-7.4786315|280.9102818|60.9269274|-37.7153676|224.8796686 unknown
InChI: InChI=1S/C20H32Cl2N2O2/c1-2-3-9-24(13-12-23-10-5-4-6-11-23)15-18(25)16-26-20-8-7-17(21)14-19(20)22/h7-8,14,18,25H,2-6,9-13,15-16H2,1H3
charge 0 multiplicity 1
58 atoms
Cl 0.328844 -3.327478 1.102898
Cl 4.965021 -4.300777 3.999501
O  1.909191 1.925335 2.652746
O  1.292492 -0.520054 1.049934
N  -3.215441 -0.520143 -0.722954
N  -0.823499 2.363472 0.052026
C  -3.832334 -0.254497 -2.047606
C  -3.137136 -1.97909 -0.448007
C  -1.918821 0.175854 -0.545137
C  -5.255652 -0.842592 -2.130931
C  -4.540198 -2.619609 -0.474142
C  -5.236439 -2.358207 -1.828923
C  -2.116436 1.664692 -0.176474
C  -0.225415 2.083777 1.377784
C  -0.862173 3.817019 -0.268306
C  1.316589 1.957443 1.301563
C  -0.834505 4.120339 -1.783212
C  0.465624 3.66969 -2.484345
C  1.762882 0.758613 0.452584
C  0.465213 3.973636 -3.997849
C  2.195703 -1.33478 1.736914
C  1.860496 -2.710466 1.856686
C  3.399842 -0.881498 2.336404
C  2.686914 -3.617106 2.543994
C  4.247922 -1.779384 3.02076
C  3.881055 -3.133785 3.114647
H  -3.869708 0.837853 -2.21385
H  -3.206044 -0.692231 -2.871961
H  -2.48437 -2.500306 -1.198484
H  -2.669607 -2.120322 0.543899
H  -1.361173 -0.332484 0.26336
H  -1.273469 0.116812 -1.457896
H  -5.898289 -0.325694 -1.392167
H  -5.675734 -0.64941 -3.137158
H  -4.452081 -3.706578 -0.282743
H  -5.145241 -2.18107 0.343093
H  -6.264753 -2.766958 -1.823188
H  -4.682258 -2.885298 -2.633378
H  -2.638063 2.178485 -1.003655
H  -2.79042 1.721832 0.710447
H  -0.464775 2.872811 2.127991
H  -0.630931 1.130467 1.766806
H  -1.757532 4.30394 0.192905
H  0.024565 4.290011 0.197593
H  1.740826 2.870636 0.845561
H  -1.701703 3.641704 -2.282042
H  -0.968421 5.214067 -1.916786
H  1.330542 4.174364 -2.005046
H  0.5994 2.583954 -2.314494
H  2.85947 0.737874 0.322074
H  1.259954 0.816182 -0.527534
H  1.406087 3.645418 -4.476698
H  0.350041 5.0578 -4.187615
H  -0.369983 3.454984 -4.505838
H  1.485312 1.187659 3.163509
H  3.655716 0.181421 2.300676
H  2.407632 -4.670691 2.621188
H  5.171472 -1.419833 3.482676
