program: Gaussian 09
title: 000211288
version: EM64L-G09RevD.01
frameworkgroup: C1[X(C18H28Cl2N2O3)]
method: RPBEPBE
basis: SDD
operation: Freq
keyword: #p
keyword: freq=noraman
keyword: PBEPBE/SDD
title: #p freq=noraman PBEPBE/SDD
converged: YES YES NO NO
title: Mulliken charges:
elementType: Cl Cl O O O N N C C C C C C C C C C C C C C C C C C H H H H H H H H H H H H H H H H H H H H H H H H H H H H
charge: -0.025899 -0.051007 -0.246229 -0.453322 -0.279296 -0.091225 -0.134604 -0.351249 -0.377232 -0.340920 -0.349304 -0.406113 -0.340878 -0.099962 -0.320418 -0.315929 -0.365477 -0.305595 -0.674042 0.512987 -0.307347 -0.306701 -0.198474 -0.222758 -0.107393 0.178893 0.213059 0.224281 0.204550 0.235129 0.213937 0.207016 0.192830 0.188994 0.212203 0.200954 0.202658 0.207506 0.215866 0.193285 0.193066 0.214520 0.197625 0.201306 0.218738 0.237423 0.205428 0.219979 0.215438 0.363746 0.260943 0.281751 0.257265
chargesum: 0.00000
title: Mulliken charges with hydrogens summed into heavy atoms:
elementType: Cl Cl O O O N N C C C C C C C C C C C C C C C C C C
charge: -0.025899 -0.051007 -0.246229 -0.089576 -0.279296 -0.091225 -0.134604 0.040703 0.051599 0.058927 0.051892 0.042953 0.062733 0.107543 0.088733 0.091657 0.033454 0.150566 -0.033197 0.512987 -0.307347 -0.045759 0.083276 0.034507 -0.107393
polarizability: 2.79877893e+02 1.17222989e+01 2.58649680e+02 4.93309162e+00 2.54030690e+01 1.83583275e+02
1716.lowfreq: -23.1991 -4.6396 -0.0019 -0.0016 -0.0003 0.6633 5.4306 14.1250 19.0098
frequency: -17.1993 13.9508 18.9621 21.9824 30.2247 43.4908 47.5199 54.8405 67.1397 91.1257 109.7906 115.7561 131.0680 147.2934 165.6553 176.1732 182.9740 192.4388 210.8561 224.0618 238.5124 257.7179 280.5663 308.6718 323.2122 325.3641 328.7679 362.0407 375.7526 377.9670 392.9724 399.3099 436.9256 440.5973 442.3347 453.3027 466.2020 479.2114 508.5821 537.4714 546.3674 548.0108 604.5831 639.2656 696.2750 706.9005 738.7650 769.0828 786.8907 799.2863 807.1904 811.0061 832.1729 840.6562 853.7806 862.4521 870.2281 893.4471 904.7655 914.0163 927.7193 971.6116 994.6898 1003.9164 1018.1233 1026.3451 1030.8033 1047.2902 1053.8362 1061.8697 1071.5833 1081.2524 1084.1126 1088.2190 1092.9571 1097.9819 1109.0821 1133.5852 1137.4480 1146.7641 1155.5307 1184.8903 1191.0455 1200.9403 1223.4322 1235.1581 1240.6034 1254.3459 1256.4822 1263.8325 1271.3068 1276.6320 1284.3975 1292.5229 1295.3136 1311.1924 1319.6760 1332.6497 1335.8641 1344.9331 1351.0872 1357.7149 1363.0762 1363.9161 1371.4139 1376.0266 1386.0041 1389.5930 1395.0460 1399.4660 1442.5083 1447.1318 1448.8531 1451.5459 1457.7301 1461.2116 1467.2034 1468.9368 1469.8928 1474.7584 1479.2273 1483.4494 1488.4453 1569.9135 1596.1263 2847.2201 2856.8794 2869.8970 2871.4948 2889.7402 2916.1659 2955.4431 2958.8587 2961.9627 2976.0757 2976.7631 2980.3158 3017.3784 3025.2252 3030.0416 3033.8994 3037.0029 3043.2672 3060.1558 3062.9142 3072.0142 3081.0266 3083.3341 3084.1712 3162.1960 3180.6447 3183.0970 3544.9640
redmass: 5.9686 7.8662 4.5519 4.4043 3.5136 3.3894 6.2454 4.7070 5.3857 3.2848 3.4917 2.3389 5.4077 5.2940 5.9770 3.8613 3.6859 3.8295 1.7617 2.3629 1.9160 4.0932 2.3898 4.1584 2.2443 2.6017 7.5230 5.3417 4.2073 2.9349 3.9721 2.2546 2.2658 1.7617 1.9259 2.3099 2.7950 4.1235 3.3195 3.4661 4.0742 3.6103 1.9319 7.6887 3.9013 7.6549 1.9484 2.2042 1.3825 1.4802 3.2397 5.9466 2.1720 1.6034 2.4733 1.3837 2.0585 2.3378 1.8423 1.5985 1.3741 6.2765 2.7180 2.0334 2.4851 2.1728 3.7526 2.6772 1.8725 2.4326 1.9345 2.3256 2.5467 2.2167 2.6111 2.5045 2.2903 2.3424 2.4796 1.3148 1.5623 2.2354 1.0878 1.4315 1.2360 2.5015 1.3556 1.5033 1.2430 1.2738 1.2619 1.3626 1.3641 1.2752 1.1679 1.3147 1.3578 1.2637 1.2587 1.3787 1.3303 2.8330 1.5364 1.4431 1.2668 1.4390 1.2890 4.1782 1.4281 1.7498 1.0818 1.0863 1.2865 1.0954 1.0959 1.0944 1.3647 1.1275 1.3009 1.0821 1.0677 1.0782 1.0606 7.8057 7.6253 1.0698 1.0706 1.0688 1.0709 1.0710 1.0692 1.0664 1.0665 1.0813 1.0584 1.0416 1.0556 1.0932 1.0884 1.0879 1.0946 1.0892 1.0919 1.1050 1.0919 1.0994 1.0962 1.0995 1.0980 1.0879 1.0956 1.0946 1.0656
irintensity: 0.3434 0.5442 0.0801 0.0215 0.0072 0.3973 1.0939 0.1133 0.1074 1.0154 0.4917 0.4950 0.4934 4.8648 0.1014 5.8489 1.7546 4.8348 0.5780 0.3648 2.0614 4.9677 3.2568 2.8633 7.7115 9.8263 0.5886 4.3702 0.7731 2.7646 0.0545 0.9858 35.1741 42.6725 71.5773 35.8599 1.2886 6.5144 10.8852 8.5759 6.7140 0.1685 4.9760 20.9478 1.6851 76.8202 5.0082 14.5208 5.4551 42.2006 24.7648 9.3929 14.0134 0.8885 2.6126 22.3366 8.1174 6.7437 15.1602 8.9010 2.6298 71.8159 11.3846 66.5080 55.6914 5.4471 110.3961 9.3653 32.2548 6.1804 5.2734 39.6938 29.6339 15.3577 43.6193 19.7070 11.8387 31.7143 44.0498 4.3440 11.4279 3.2193 2.5415 13.7614 6.2238 166.2828 23.0009 90.7807 25.6408 10.5849 1.8005 19.2510 12.7897 7.6112 5.9949 10.3818 11.6531 3.7673 0.4643 3.0268 2.6750 19.8995 4.3021 4.1831 2.0730 4.5172 8.9853 1.7143 8.6427 7.5788 2.5781 11.0339 143.7201 16.2135 13.6258 11.1339 98.3466 18.0458 37.8793 0.9215 14.7023 9.4691 18.7387 25.1058 12.3812 80.6985 44.4860 178.7831 68.6683 94.9330 87.0182 29.6007 107.0701 29.3952 28.3162 60.3562 20.5502 15.8469 5.3158 54.7987 33.8470 35.7184 36.2680 21.2801 46.2512 60.1526 39.8396 64.4351 26.4613 5.1735 1.1629 2.2039 14.6700
temp: 298.150 k
press: 1.00000 atm
elementType: 17 17 8 8 8 7 7 6 6 6 6 6 6 6 6 6 6 6 6 6 6 6 6 6 6 1 1 1 1 1 1 1 1 1 1 1 1 1 1 1 1 1 1 1 1 1 1 1 1 1 1 1 1
symmnumber: 1
zpe: 1150677.7 jmol-1
zpe.correction: 0.438270 hartree
zpe.thermalcorrener: 0.464482 hartree
zpe.thermalcorrenthalpy: 0.465426 hartree
zpe.thermalcorrgfe: 0.377935 hartree
zpe.sumelectzpe: -1955.973435 hartree
zpe.sumelectthermal: -1955.947224 hartree
zpe.sumelectthermalent: -1955.946279 hartree
zpe.sumelectthermalfe: -1956.033770 hartree
dipole: -2.3266 -0.8602 2.0133
dipole: 3.1948
quadrupole: -184.3710 -172.3737 -169.3173
quadrupole: 8.4691 -4.8698 -0.2630
quadrupole: -9.0170 2.9803 6.0367 8.4691 -4.8698 -0.2630
hfenergy: -1956.4117054 hartree
pointgroup: C01 [X(C18H28Cl2N2O3)]
dipole: -0.8002485 0.2886168 -0.9252771 debye
polarizability: 276.8227829|-14.7479864|267.108106|8.6147535|10.9341811|178.1799596 unknown
InChI: InChI=1S/C18H28Cl2N2O3/c1-2-5-22(7-6-21-8-10-24-11-9-21)13-16(23)14-25-18-4-3-15(19)12-17(18)20/h3-4,12,16,23H,2,5-11,13-14H2,1H3
charge 0 multiplicity 1
53 atoms
Cl 5.421702 1.32231 1.427567
Cl 6.024101 -4.124256 0.499774
O  -6.082418 -2.520276 0.80153
O  0.961911 2.656292 2.207805
O  2.57152 0.810012 0.831724
N  -4.014084 -0.75259 -0.225439
N  -1.385031 1.990522 -0.635681
C  -2.667184 -0.147439 -0.351624
C  -2.735583 1.370251 -0.633919
C  -4.6240 -0.535372 1.113281
C  -4.033435 -2.200272 -0.56365
C  -0.900075 2.317089 0.729712
C  -1.27059 3.138166 -1.580636
C  0.628572 2.191455 0.85607
C  -6.05888 -1.086602 1.136616
C  -5.477752 -2.725686 -0.525294
C  -1.124464 2.706184 -3.057489
C  1.103088 0.751362 0.648713
C  0.180505 1.93327 -3.339078
C  3.30251 -0.370179 0.743757
C  4.698007 -0.284087 0.995983
C  2.753025 -1.636071 0.418679
C  5.5325 -1.411791 0.924911
C  3.575843 -2.781848 0.343185
C  4.952584 -2.654233 0.595562
H  -2.042281 -0.338075 0.558794
H  -2.14338 -0.62439 -1.200869
H  -3.194773 1.506054 -1.627936
H  -3.414012 1.871425 0.097693
H  -1.179245 3.347868 1.049152
H  -1.361515 1.625019 1.457982
H  -4.647366 0.546632 1.338816
H  -4.025458 -1.040687 1.914125
H  -3.410579 -2.799835 0.148013
H  -3.619784 -2.336632 -1.580794
H  -0.374799 3.723684 -1.298518
H  -2.144404 3.828782 -1.478509
H  1.133058 2.82969 0.099135
H  -6.497924 -1.012813 2.145246
H  -6.685226 -0.5222 0.412539
H  -6.082171 -2.202152 -1.297287
H  -5.512107 -3.81375 -0.700072
H  -1.994588 2.086872 -3.352627
H  -1.166356 3.618125 -3.686819
H  0.666362 0.078531 1.414331
H  0.845822 0.402695 -0.368387
H  1.068097 2.562508 -3.136527
H  0.242794 1.040049 -2.692109
H  0.233475 1.604003 -4.392735
H  1.935126 2.51454 2.341872
H  1.682737 -1.7354 0.219668
H  6.603268 -1.321223 1.123147
H  3.14546 -3.75463 0.090719
