program: Gaussian 09
title: 000211286
version: EM64L-G09RevD.01
frameworkgroup: C1[X(C17H26Cl2N2O3)]
method: RPBEPBE
basis: SDD
operation: Freq
keyword: #p
keyword: freq=noraman
keyword: PBEPBE/SDD
title: #p freq=noraman PBEPBE/SDD
converged: YES YES NO NO
title: Mulliken charges:
elementType: Cl Cl O O O N N C C C C C C C C C C C C C C C C C H H H H H H H H H H H H H H H H H H H H H H H H H H
charge: -0.028144 -0.047474 -0.246834 -0.440055 -0.296197 -0.094822 -0.122756 -0.353488 -0.382245 -0.349944 -0.346354 -0.418256 -0.317109 -0.319925 -0.326715 -0.128977 -0.315113 -0.672410 0.539431 -0.310894 -0.312381 -0.198596 -0.216785 -0.113952 0.206331 0.215386 0.218974 0.203433 0.209738 0.193890 0.202014 0.202655 0.231695 0.228434 0.190460 0.213316 0.213911 0.190323 0.207899 0.197195 0.218200 0.239369 0.235118 0.211447 0.215090 0.217029 0.353112 0.263170 0.283742 0.258070
chargesum: 0.00000
title: Mulliken charges with hydrogens summed into heavy atoms:
elementType: Cl Cl O O O N N C C C C C C C C C C C C C C C C C
charge: -0.028144 -0.047474 -0.246834 -0.086944 -0.296197 -0.094822 -0.122756 0.068229 0.040161 0.053683 0.058314 0.041872 0.086666 0.084308 0.078379 0.089223 0.159374 -0.028844 0.539431 -0.310894 -0.049210 0.085146 0.041284 -0.113952
polarizability: 2.62134141e+02 -3.28501504e+01 2.04546113e+02 2.02132740e+01 1.39666477e+01 2.08652471e+02
1716.lowfreq: -9.5419 -5.9093 0.0014 0.0015 0.0019 2.7829 10.9802 14.9181 21.6097
frequency: 10.4297 14.6988 21.5804 26.3738 32.0803 51.1275 67.4278 71.3588 82.2857 98.8926 115.2579 143.0933 156.5736 159.9307 165.3172 181.7793 189.7789 221.7315 241.4466 245.4152 274.0123 284.7279 310.3556 324.6433 330.3233 347.7208 363.4018 386.5144 390.2796 394.9738 415.6397 426.6425 436.4211 450.7905 471.5974 479.5862 512.5056 525.3256 545.7344 570.1504 606.1877 645.5039 694.3140 719.2789 755.5247 784.2649 795.1892 799.8647 801.1164 810.1666 819.1565 838.2768 843.2164 861.3363 895.4991 916.4009 930.0265 938.6966 957.4904 991.8881 998.5101 1027.6175 1028.8895 1036.6327 1051.3300 1054.1137 1065.1319 1070.9052 1083.7513 1087.6001 1094.5643 1104.9740 1109.8974 1130.6587 1132.8520 1146.6576 1162.5377 1189.0482 1191.9133 1219.7494 1230.2418 1233.1302 1243.0857 1256.0559 1258.6770 1269.0754 1281.1225 1286.5091 1292.3042 1298.0988 1321.6944 1327.4829 1335.2541 1350.5808 1351.6955 1358.9363 1361.9093 1365.4613 1370.9324 1373.8512 1382.4910 1389.4313 1390.9555 1395.0673 1444.1487 1444.2843 1450.0020 1452.1769 1459.6770 1462.4570 1468.1799 1471.3592 1472.2380 1478.9238 1485.6752 1488.8136 1569.5924 1596.1868 2862.5570 2868.3923 2871.6961 2887.4855 2888.5466 2924.0223 2952.8745 2956.8235 2983.6916 2985.6047 3019.2593 3024.6446 3029.0183 3032.9190 3038.3997 3054.8280 3061.7472 3063.3088 3078.4170 3079.0444 3082.3307 3088.1828 3163.9267 3181.2042 3183.4024 3537.4610
redmass: 8.5840 5.1391 4.3474 6.5518 4.1082 4.2979 3.9878 4.8511 2.9708 4.7796 3.4285 8.0086 3.9800 2.0510 5.6488 9.5611 2.7814 3.1037 1.6842 1.7848 5.9971 2.6048 2.6340 2.6047 7.0790 3.4193 8.3213 4.5564 2.8902 2.2099 2.5350 1.2064 3.1222 2.8682 2.8178 3.6163 5.1714 3.5893 4.1400 3.6840 1.9303 6.7351 3.9338 5.9819 3.2470 1.3238 1.6087 1.9706 1.4781 3.8396 3.5593 3.0449 1.5964 1.3881 2.3660 2.2704 1.5022 2.9063 2.6470 2.1450 2.6423 2.3553 3.3900 2.4811 2.4064 1.9882 2.3764 2.3335 2.5121 2.8428 2.4530 2.0502 2.1296 2.0994 2.6947 1.3280 1.7165 1.9408 1.1043 1.4472 1.6702 1.3276 1.5962 1.4488 1.4642 1.3218 1.5027 1.2353 1.2973 1.1738 1.3270 1.4266 1.2354 1.3014 1.4096 2.8175 1.4135 1.4007 1.2682 1.4236 1.3268 1.2667 4.5740 1.4231 1.2391 1.0978 1.0792 1.0952 1.0788 1.0718 1.7964 1.0849 1.1310 1.0740 1.0814 1.0728 7.8228 7.5650 1.0703 1.0697 1.0712 1.0687 1.0712 1.0689 1.0664 1.0665 1.0357 1.0548 1.0883 1.0897 1.0880 1.0900 1.0868 1.0908 1.1078 1.0921 1.0984 1.0961 1.0978 1.1004 1.0879 1.0945 1.0959 1.0655
irintensity: 0.0347 0.2951 0.1412 0.4019 0.3366 0.4023 0.2999 0.3512 0.9918 0.3203 0.5159 0.0969 4.9308 3.1615 0.2125 2.4661 7.9675 1.1696 1.1673 1.7334 1.5746 6.9581 0.5058 10.0042 1.1262 1.6895 2.0516 1.0313 0.0524 3.9924 9.8656 136.4892 5.1864 40.3308 0.3363 10.0908 3.6037 2.5213 7.3086 21.5780 5.8878 6.0698 1.9548 57.5507 15.6044 8.2035 7.3081 13.1550 51.2600 7.3795 7.8076 25.6209 0.6711 22.9768 6.6157 21.7225 10.7744 45.6666 9.2458 28.8537 36.1309 7.6439 60.7154 41.3699 19.5981 15.9543 54.0643 12.0413 35.4439 19.1940 31.7642 24.2887 20.7728 1.0358 58.7546 5.0610 23.0754 10.8463 3.9987 15.6362 117.8694 12.5933 11.3208 39.3171 84.1886 5.1523 30.2828 17.2586 5.0011 2.6563 3.9640 8.4954 2.1376 4.6746 2.8286 16.7688 5.9140 3.8631 0.8845 6.8909 26.3960 29.5072 1.8960 1.7764 165.3747 12.7058 1.3145 18.6435 0.3772 11.4269 126.9888 0.9928 12.3871 4.2445 14.1325 9.8893 15.0229 6.7537 37.6720 49.0664 75.7666 147.1076 73.4543 83.4249 33.3762 112.7478 26.7599 25.1550 19.9736 12.0629 48.0921 37.6094 4.3256 30.3907 27.5545 44.8702 55.8232 37.6773 28.7605 46.3920 3.9073 0.1101 3.0084 11.6806
temp: 298.150 k
press: 1.00000 atm
elementType: 17 17 8 8 8 7 7 6 6 6 6 6 6 6 6 6 6 6 6 6 6 6 6 6 1 1 1 1 1 1 1 1 1 1 1 1 1 1 1 1 1 1 1 1 1 1 1 1 1 1
symmnumber: 1
zpe: 1078410.8 jmol-1
zpe.correction: 0.410745 hartree
zpe.thermalcorrener: 0.436441 hartree
zpe.thermalcorrenthalpy: 0.437385 hartree
zpe.thermalcorrgfe: 0.350510 hartree
zpe.sumelectzpe: -1916.751553 hartree
zpe.sumelectthermal: -1916.725856 hartree
zpe.sumelectthermalent: -1916.724912 hartree
zpe.sumelectthermalfe: -1916.811787 hartree
dipole: 2.3729 -1.5893 -2.7915
dipole: 3.9936
quadrupole: -161.0377 -175.8376 -154.1654
quadrupole: 5.0277 -1.2266 8.3872
quadrupole: 2.6425 -12.1574 9.5148 5.0277 -1.2266 8.3872
hfenergy: -1917.1622975 hartree
pointgroup: C01 [X(C17H26Cl2N2O3)]
dipole: 0.2489361 0.9483102 -1.2277809 debye
polarizability: 200.212857|-16.3562057|276.0734927|-21.9472353|-4.1947477|199.0463755 unknown
InChI: InChI=1S/C17H26Cl2N2O3/c1-2-20(5-6-21-7-9-23-10-8-21)12-15(22)13-24-17-4-3-14(18)11-16(17)19/h3-4,11,15,22H,2,5-10,12-13H2,1H3
charge 0 multiplicity 1
50 atoms
Cl 0.540171 -1.004534 3.056585
Cl 3.223198 -5.040021 0.332009
O  -4.277773 -2.673436 0.240671
O  1.978364 3.430814 1.840031
O  1.705538 0.758254 0.992611
N  -2.709514 -0.387355 -0.650966
N  -0.675745 2.845915 -0.820077
C  -1.515899 0.485423 -0.775894
C  -1.888811 1.983998 -0.81809
C  -2.476887 -1.750023 -1.199784
C  -3.204324 -0.490746 0.748965
C  -0.095435 3.039178 0.532469
C  -3.777548 -2.566966 -1.140143
C  -4.495187 -1.324691 0.791093
C  -0.856109 4.126095 -1.559715
C  1.453893 3.090536 0.509589
C  2.077715 1.789423 -0.005469
C  -0.844745 3.943834 -3.088974
C  2.094587 -0.558238 0.773978
C  1.61923 -1.530857 1.694012
C  2.922044 -0.988734 -0.293542
C  1.953117 -2.88972 1.573554
C  3.268926 -2.350881 -0.432171
C  2.78215 -3.281566 0.502196
H  -1.000538 0.24198 -1.723861
H  -0.782804 0.297962 0.046401
H  -2.461968 2.165921 -1.743152
H  -2.568362 2.239582 0.030177
H  -2.147634 -1.662125 -2.252555
H  -1.679598 -2.293327 -0.631644
H  -2.436687 -0.964622 1.412131
H  -3.413455 0.521172 1.142652
H  -0.453757 3.974373 1.020006
H  -0.399274 2.19749 1.180778
H  -4.547501 -2.084102 -1.780483
H  -3.612916 -3.604715 -1.474688
H  -4.834124 -1.481602 1.828571
H  -5.289842 -0.807573 0.210739
H  -0.024023 4.798357 -1.276649
H  -1.796442 4.644924 -1.247233
H  1.795124 3.915756 -0.141139
H  1.650614 1.531762 -0.993196
H  3.180085 1.876247 -0.049896
H  -0.966267 4.919575 -3.595184
H  -1.664661 3.28624 -3.429796
H  0.109508 3.493357 -3.414647
H  1.842656 2.638997 2.423868
H  3.300752 -0.265696 -1.020448
H  1.573926 -3.619472 2.292999
H  3.909434 -2.675665 -1.256492
