program: Gaussian 09
title: 000211284
version: EM64L-G09RevD.01
frameworkgroup: C1[X(C16H24Cl2N2O3)]
method: RPBEPBE
basis: SDD
operation: Freq
keyword: #p
keyword: freq=noraman
keyword: PBEPBE/SDD
title: #p freq=noraman PBEPBE/SDD
converged: YES YES NO NO
title: Mulliken charges:
elementType: Cl Cl O O O N N C C C C C C C C C C C C C C C C H H H H H H H H H H H H H H H H H H H H H H H H
charge: -0.040019 -0.058779 -0.248290 -0.473652 -0.281172 -0.093599 -0.101503 -0.355956 -0.374689 -0.350621 -0.349254 -0.413489 -0.314608 -0.323244 -0.020932 -0.644497 -0.351903 0.462424 -0.277970 -0.300325 -0.207003 -0.230028 -0.102659 0.204151 0.190187 0.200518 0.248466 0.206849 0.188667 0.190864 0.227043 0.253646 0.194575 0.191074 0.211064 0.215760 0.193264 0.199769 0.199491 0.218555 0.235582 0.250757 0.236826 0.344482 0.314806 0.280248 0.255125
chargesum: 0.00000
title: Mulliken charges with hydrogens summed into heavy atoms:
elementType: Cl Cl O O O N N C C C C C C C C C C C C C C C C
charge: -0.040019 -0.058779 -0.248290 -0.129170 -0.281172 -0.093599 -0.101503 0.038383 0.074295 0.044895 0.068652 0.034731 0.087531 0.085780 0.178837 0.009131 0.135679 0.462424 -0.277970 0.014481 0.073245 0.025097 -0.102659
polarizability: 2.91947753e+02 8.10536107e+00 2.30037106e+02 4.73020592e+00 7.95494469e+00 1.36071867e+02
1716.lowfreq: -15.1410 -12.5607 -5.6001 -0.0019 0.0005 0.0009 2.7514 13.7745 21.8634
frequency: -13.1086 12.9445 21.7063 24.9486 34.4622 47.1162 58.7983 85.0964 92.6428 107.8188 140.4060 153.4676 164.9802 172.8640 188.7728 197.3532 221.7911 233.6225 239.5749 257.6176 276.2258 301.2365 307.9793 324.5502 331.4732 342.5358 368.7588 390.2925 397.9342 416.1041 436.3922 439.9929 455.9354 472.4755 503.1367 526.3224 544.5554 598.5345 606.8338 630.0921 679.6300 699.4628 759.9585 773.1993 795.4156 811.7024 815.1188 819.5675 837.9105 842.4422 857.5347 899.0995 904.3378 931.1319 941.2543 996.3961 1002.2331 1022.6994 1029.1877 1037.7607 1048.0925 1055.2918 1056.3625 1062.8131 1080.6007 1086.3783 1088.8589 1103.0308 1112.2527 1126.6548 1138.4703 1147.0168 1155.7492 1190.2010 1203.5150 1208.5492 1225.5808 1243.9722 1257.2687 1259.3072 1266.9747 1272.3942 1285.7627 1294.3251 1299.9976 1302.3329 1324.9175 1335.5890 1344.1528 1354.0108 1356.8366 1363.4537 1368.4206 1376.5309 1386.0330 1387.1573 1397.0928 1436.8503 1442.6931 1448.0428 1449.3498 1450.5234 1458.7288 1462.4241 1464.5310 1470.4600 1472.6097 1480.5425 1484.1909 1568.1100 1592.7235 2856.6184 2861.2180 2864.8363 2873.2388 2890.0489 2909.2461 2944.7557 2952.2843 2959.0553 3015.3625 3019.3212 3023.7407 3025.1844 3045.4489 3049.6898 3057.8401 3076.6884 3077.2533 3083.7401 3099.6453 3157.7837 3175.8157 3182.2335 3562.1925
redmass: 5.5548 4.3925 5.0251 5.1003 7.5054 3.7766 4.7888 4.6099 3.8834 4.1956 2.9503 7.4868 6.3782 2.8521 2.0181 4.2536 2.6529 2.0610 1.8090 1.5075 3.2983 4.3095 2.4890 3.1824 5.1041 3.9054 5.7586 4.7076 2.1742 2.3302 4.6398 3.3553 2.4722 2.5973 5.0895 3.5249 4.1952 3.6017 2.0340 5.2565 5.8238 4.2862 2.9814 5.6298 1.6563 2.7239 1.6991 2.5022 2.6169 1.9924 1.3806 2.4284 2.8924 2.6480 1.3442 3.0541 2.7417 3.3399 2.3599 2.2575 2.3386 2.0126 2.0725 2.6533 2.4478 3.0614 2.2741 1.7866 1.6561 2.4424 2.5816 1.4853 1.4553 1.0715 1.4507 1.3906 2.4681 1.5801 1.3009 1.3414 1.3494 1.3134 1.1878 1.2513 1.3803 1.5679 1.3486 1.2622 1.3554 1.4475 3.7747 1.3179 1.2944 1.3958 1.9173 3.3242 1.3550 1.1571 1.0826 1.0893 1.1039 1.0950 1.0945 1.1665 1.9336 1.1426 1.0609 1.0828 1.0564 7.8937 7.2404 1.0695 1.0706 1.0562 1.0687 1.0693 1.0700 1.0829 1.0663 1.0665 1.0878 1.0607 1.0829 1.0812 1.0921 1.0901 1.0905 1.1004 1.0966 1.0976 1.1047 1.0891 1.0966 1.0936 1.0660
irintensity: 0.1115 0.1075 0.3883 0.3564 0.3657 0.4571 0.5918 0.0856 0.8653 0.7537 0.6156 0.6987 0.2066 2.1716 4.4925 0.5719 5.1997 37.5213 7.2094 87.5394 3.2495 15.2455 2.1098 20.7068 16.2428 5.0008 4.9055 5.8224 1.0266 17.5309 2.3381 6.2038 2.3102 1.0556 4.8677 6.0694 9.4165 36.4326 10.5984 14.4119 25.3416 4.1443 10.3448 48.4384 6.8646 19.5528 32.0876 27.6256 4.0766 0.4712 23.7093 7.8398 31.8405 45.6768 2.2620 7.9709 40.3038 45.6344 9.3433 76.5941 7.7163 75.2863 51.9570 7.3834 44.8340 23.5789 5.0008 7.1350 3.8078 28.4174 37.6579 41.1710 13.0210 0.3204 71.5404 0.6091 122.5436 4.0803 1.5725 59.3013 47.6425 10.8278 33.5151 2.5276 9.4480 17.3584 8.2033 7.8968 2.1476 6.1571 15.7313 12.2078 1.4718 1.9028 12.1257 5.0226 2.6430 4.0828 2.4459 14.5851 24.2726 10.9182 14.3340 55.0315 219.3226 22.8209 5.7335 4.5387 17.6732 18.9548 8.2512 54.8441 28.0449 121.6767 92.8988 140.6163 117.3831 51.1032 51.8194 90.0605 7.7420 31.0197 48.0472 60.2950 16.7564 11.8485 40.3060 43.9773 45.2888 31.6619 8.2016 9.3920 5.1283 0.2019 6.1889
temp: 298.150 k
press: 1.00000 atm
elementType: 17 17 8 8 8 7 7 6 6 6 6 6 6 6 6 6 6 6 6 6 6 6 6 1 1 1 1 1 1 1 1 1 1 1 1 1 1 1 1 1 1 1 1 1 1 1 1
symmnumber: 1
zpe: 1002436.9 jmol-1
zpe.correction: 0.381808 hartree
zpe.thermalcorrener: 0.405561 hartree
zpe.thermalcorrenthalpy: 0.406505 hartree
zpe.thermalcorrgfe: 0.325302 hartree
zpe.sumelectzpe: -1877.523417 hartree
zpe.sumelectthermal: -1877.499664 hartree
zpe.sumelectthermalent: -1877.498720 hartree
zpe.sumelectthermalfe: -1877.579923 hartree
dipole: 1.7371 6.4467 -0.2714
dipole: 6.6822
quadrupole: -162.1667 -144.0020 -152.0677
quadrupole: 7.0882 -2.4160 0.0980
quadrupole: -9.4213 8.7435 0.6778 7.0882 -2.4160 0.0980
hfenergy: -1877.9052254 hartree
pointgroup: C01 [X(C16H24Cl2N2O3)]
dipole: -0.2242397 2.5911479 -0.3836295 debye
polarizability: 279.8939122|-10.9322362|228.2607172|34.3883668|-26.930248|149.902096 unknown
InChI: InChI=1S/C16H24Cl2N2O3/c1-19(4-5-20-6-8-22-9-7-20)11-14(21)12-23-16-3-2-13(17)10-15(16)18/h2-3,10,14,21H,4-9,11-12H2,1H3
charge 0 multiplicity 1
47 atoms
Cl 0.476333 -2.517338 0.838602
Cl 5.868933 -2.904797 2.098517
O  -5.031163 -2.761079 -0.762502
O  2.533208 2.960161 0.170455
O  1.201292 0.190003 -0.163734
N  -3.799777 -0.13889 -0.503569
N  -1.224546 2.665417 -0.292227
C  -3.085058 1.091688 -0.915552
C  -2.105016 1.569936 0.181038
C  -5.105542 -0.314378 -1.189185
C  -2.976808 -1.368092 -0.660058
C  0.047595 2.809679 0.446559
C  -5.836755 -1.538429 -0.611937
C  -3.730783 -2.579969 -0.092323
C  1.256873 2.684909 -0.515344
C  -1.915445 3.941602 -0.553828
C  1.357622 1.291088 -1.142182
C  2.327318 -0.46398 0.340097
C  2.134425 -1.770684 0.862393
C  3.630877 0.092354 0.38608
C  3.195444 -2.519089 1.402577
C  4.711382 -0.64734 0.91355
C  4.480508 -1.942346 1.411475
H  -3.845816 1.873072 -1.103784
H  -2.511566 0.955199 -1.866742
H  -2.698906 1.857013 1.082516
H  -1.453997 0.726209 0.468572
H  -5.722854 0.590061 -1.027841
H  -4.979071 -0.455804 -2.292908
H  -2.74065 -1.556491 -1.738374
H  -2.018681 -1.253092 -0.122942
H  0.143251 2.027678 1.221187
H  0.10661 3.794147 0.967428
H  -6.054283 -1.36302 0.46413
H  -6.776508 -1.735204 -1.154583
H  -3.174306 -3.514563 -0.271929
H  -3.88886 -2.441295 0.998878
H  1.117783 3.402314 -1.355464
H  -2.399395 4.373265 0.357893
H  -1.197386 4.685115 -0.944095
H  -2.6963 3.80832 -1.322646
H  0.499489 1.167481 -1.822666
H  2.305339 1.180238 -1.700408
H  2.445743 3.781898 0.715984
H  3.779503 1.126838 0.064302
H  3.021173 -3.523677 1.795255
H  5.71257 -0.20923 0.948737
