program: Gaussian 09
title: 000211280
version: EM64L-G09RevD.01
frameworkgroup: C1[X(C18H29ClN2O2S)]
method: RPBEPBE
basis: SDD
operation: Freq
keyword: #p
keyword: freq=noraman
keyword: PBEPBE/SDD
title: #p freq=noraman PBEPBE/SDD
converged: YES YES NO NO
title: Mulliken charges:
elementType: Cl S O O N N C C C C C C C C C C C C C C C C C C H H H H H H H H H H H H H H H H H H H H H H H H H H H H H
charge: -0.060952 0.197665 -0.246444 -0.447045 -0.141766 -0.093551 -0.367652 -0.360829 -0.039311 -0.395002 -0.341044 -0.350002 -0.013988 -0.320530 -0.315821 -0.695996 -0.692122 -0.768541 -0.159915 -0.137562 -0.242911 -0.236430 -0.205614 -0.107193 0.220356 0.202432 0.185162 0.213434 0.208022 0.231667 0.211633 0.192925 0.206005 0.191344 0.212519 0.228383 0.214910 0.192548 0.192331 0.214536 0.214781 0.221596 0.210610 0.218785 0.221365 0.216439 0.279606 0.279205 0.344935 0.256123 0.249039 0.253340 0.258527
chargesum: 0.00000
title: Mulliken charges with hydrogens summed into heavy atoms:
elementType: Cl S O O N N C C C C C C C C C C C C C C C C C C
charge: -0.060952 0.197665 -0.246444 -0.102110 -0.141766 -0.093551 0.055137 0.037766 0.168710 0.048298 0.057886 0.053861 0.214395 0.086928 0.091046 -0.049009 -0.035534 -0.209730 -0.159915 0.118561 0.006128 0.016910 0.052913 -0.107193
polarizability: 3.01414559e+02 2.67719681e+01 2.44011950e+02 1.30242265e+01 -9.09689778e+00 1.90947498e+02
1716.lowfreq: -5.4105 -1.6469 -0.0012 0.0014 0.0023 5.1407 10.5006 21.9575 25.1400
frequency: 10.2388 21.5974 25.0641 27.6625 36.9569 44.2874 56.3159 65.5396 88.2475 102.6517 114.8199 118.3408 147.5378 175.7696 184.9648 193.5150 207.1139 229.5400 230.2898 238.5889 269.4901 283.3171 285.7059 306.5850 317.7541 332.4220 345.7509 363.0100 385.1852 398.6935 406.9352 409.6412 427.2787 436.4481 455.1681 467.3853 481.2402 494.8740 495.9883 499.8412 572.4404 602.9577 621.2064 685.1728 691.4926 712.4853 738.9937 780.9357 789.5708 809.9231 814.3672 818.5281 821.6067 839.1779 867.3904 887.0203 897.3297 907.5403 932.2075 941.6664 957.0967 976.6052 989.3006 998.1566 1006.2552 1017.4004 1027.2930 1048.1537 1054.4314 1065.8561 1073.1478 1077.6055 1082.3111 1092.4569 1094.9370 1114.1138 1116.2642 1127.8258 1135.4049 1146.3978 1155.8449 1188.9793 1189.4135 1190.0552 1193.8145 1224.1191 1229.6318 1245.1907 1267.5488 1270.8085 1281.0228 1292.7344 1295.6579 1297.0670 1309.2032 1315.5883 1323.1107 1333.4537 1346.3528 1350.0443 1356.0839 1362.2644 1368.4283 1369.7466 1373.9593 1385.0046 1387.2296 1389.4728 1395.0650 1431.5946 1441.4525 1446.7835 1450.2776 1457.1045 1459.3042 1462.6612 1465.3328 1466.4371 1476.0468 1479.0746 1482.8049 1486.6618 1577.0651 1581.3710 2854.4245 2857.9085 2873.5388 2902.0837 2936.7889 2954.1512 2958.0918 2967.1490 2976.4954 2982.3661 2985.6724 3026.2106 3031.0482 3034.7063 3035.7357 3041.7236 3067.6140 3070.9052 3073.0965 3079.7104 3080.7410 3083.9237 3086.5903 3112.3946 3141.4003 3143.9622 3166.2534 3172.6358 3507.8994
redmass: 7.3603 5.7000 3.6855 5.0222 4.3647 3.6660 3.5001 5.2750 2.7622 6.9668 3.2189 4.7775 3.9153 5.9029 1.3079 3.8423 3.1791 1.0419 2.3506 2.0032 4.3870 6.8394 2.6951 4.9607 2.8230 2.4545 3.6968 3.3255 2.9270 2.2061 2.5477 2.5925 1.1606 2.9200 2.9297 2.7697 3.0800 3.5594 5.9686 3.9651 2.8764 1.9077 7.0868 4.2868 4.0857 7.3375 3.3035 2.9480 1.3791 3.2456 1.5273 1.9948 1.3707 1.5952 2.6841 1.9038 2.3563 1.2452 1.3714 1.3021 1.3585 2.3275 5.0160 2.6804 2.5325 2.2765 2.1766 2.8353 1.8555 6.1840 2.5146 2.1030 2.7832 2.4796 2.4032 1.7045 1.7637 2.0570 2.5869 1.4593 2.2469 1.8444 1.7062 1.0942 1.2083 1.2829 1.2081 1.4592 1.3155 1.2415 1.3957 1.3007 1.1455 1.2373 1.3547 1.3266 1.2395 1.2455 1.3228 1.3958 4.5904 1.4036 1.2992 1.2710 1.2524 1.4852 1.6556 2.3988 1.2808 1.1338 1.0824 1.0792 1.0954 1.0790 1.0749 1.0792 1.8778 1.0891 1.0747 1.0473 1.0656 1.0678 7.2933 6.1803 1.0701 1.0699 1.0688 1.0705 1.0666 1.0664 1.0665 1.0834 1.0350 1.0360 1.0843 1.0894 1.0870 1.0628 1.0888 1.0905 1.0927 1.0985 1.0994 1.0980 1.0962 1.0980 1.0991 1.1048 1.0895 1.0889 1.0959 1.0965 1.0653
irintensity: 0.1925 0.2936 0.0186 0.0613 0.0534 0.0160 0.3526 0.7211 0.2377 0.1892 0.2777 0.5818 5.4067 4.9536 1.0802 2.2268 1.3034 0.1887 3.7652 0.7000 0.8155 0.3139 1.8219 0.5741 14.0902 5.2030 6.1778 0.3358 0.9735 2.0973 1.3504 5.9778 97.6262 14.0882 3.6229 1.5985 24.4117 15.6292 29.6293 10.9729 7.9652 4.6793 0.2052 9.0839 0.1228 3.2583 11.7159 9.0388 4.9472 16.2799 75.9246 3.1546 0.2218 0.2328 14.6596 1.5611 6.8735 1.8840 1.0064 0.5758 0.2350 35.6359 79.4383 30.4032 83.3922 21.6281 9.2263 2.8071 18.9740 10.9465 17.7722 51.9051 41.4192 5.6796 41.9273 20.4028 11.5139 5.5590 76.1700 30.0195 16.8785 17.6658 12.2011 4.7213 5.2573 13.4379 49.1762 43.1300 6.2837 1.3939 10.4821 7.1117 9.3751 2.0258 6.3308 11.9952 6.4000 1.3890 10.2487 2.2820 4.8414 1.0437 9.7240 2.7684 25.6425 9.2399 14.1894 4.0566 11.0460 31.6286 2.3669 1.6240 19.4713 3.6157 6.6725 2.6743 92.9714 13.2246 2.0854 15.9162 8.7694 12.0946 1.6876 0.8764 59.4626 62.8465 158.5770 77.5404 54.8861 29.8476 103.8494 30.9270 32.9118 17.2432 18.0649 11.0745 48.7077 4.2950 37.2993 38.2169 21.5802 3.1194 36.1571 86.1414 40.7371 32.2887 57.2203 6.3516 3.3973 0.4787 3.0444 3.3156 6.4499
temp: 298.150 k
press: 1.00000 atm
elementType: 17 16 8 8 7 7 6 6 6 6 6 6 6 6 6 6 6 6 6 6 6 6 6 6 1 1 1 1 1 1 1 1 1 1 1 1 1 1 1 1 1 1 1 1 1 1 1 1 1 1 1 1 1
symmnumber: 1
zpe: 1167381.1 jmol-1
zpe.correction: 0.444632 hartree
zpe.thermalcorrener: 0.471021 hartree
zpe.thermalcorrenthalpy: 0.471965 hartree
zpe.thermalcorrgfe: 0.384210 hartree
zpe.sumelectzpe: -1819.438620 hartree
zpe.sumelectthermal: -1819.412230 hartree
zpe.sumelectthermalent: -1819.411286 hartree
zpe.sumelectthermalfe: -1819.499042 hartree
dipole: 0.3165 -0.4487 1.0537
dipole: 1.1882
quadrupole: -181.6709 -164.5285 -163.8837
quadrupole: -9.1125 8.4874 -4.2301
quadrupole: -11.6432 5.4992 6.1440 -9.1125 8.4874 -4.2301
hfenergy: -1819.8832517 hartree
pointgroup: C01 [X(C18H29Cl1N2O2S1)]
dipole: 0.1085137 -0.3950675 0.2251239 debye
polarizability: 296.5937873|11.2600168|232.5661441|34.080923|24.7245427|207.2140769 unknown
InChI: InChI=1S/C18H29ClN2O2S/c1-15(2)21(8-7-20-9-11-23-12-10-20)13-17(22)14-24-18-5-3-16(19)4-6-18/h3-6,15,17,22H,7-14H2,1-2H3
charge 0 multiplicity 1
53 atoms
Cl -6.080621 -1.585954 -2.677647
S  -2.32699 2.771094 0.295708
O  6.627218 0.825183 -1.357816
O  -1.112686 1.626357 3.125671
N  0.644457 -0.926346 1.037068
N  3.937992 -0.067844 -0.700847
C  2.067628 -1.072543 0.633747
C  2.500431 0.035005 -0.35371
C  -0.081042 -2.21796 1.286434
C  0.427979 0.078511 2.109589
C  4.830461 0.525113 0.329808
C  4.259696 0.499169 -2.036956
C  -0.860749 0.895519 1.875828
C  6.301917 0.268408 -0.034164
C  5.736889 0.2360 -2.372601
C  -0.337322 -2.979336 -0.032009
C  0.604719 -3.135922 2.337619
C  -0.711489 1.869093 0.696901
C  -3.329164 1.462339 -0.522621
C  -2.815101 0.209448 -0.934639
C  -4.689504 1.778357 -0.770965
C  -3.653643 -0.720688 -1.591095
C  -5.530482 0.856332 -1.429742
C  -4.998404 -0.385124 -1.831011
H  2.20285 -2.039465 0.120677
H  2.751394 -1.084499 1.51465
H  2.248797 1.043176 0.063759
H  1.903775 -0.083844 -1.277415
H  -1.069534 -1.925268 1.694124
H  0.348717 -0.378814 3.120701
H  1.286045 0.774886 2.144476
H  4.663574 1.629204 0.419393
H  4.615323 0.068377 1.313407
H  4.068814 1.601497 -2.076346
H  3.619031 0.013103 -2.796815
H  -1.699079 0.19582 1.674562
H  6.981068 0.773401 0.672567
H  6.500063 -0.825192 -0.028382
H  5.912601 -0.859841 -2.43311
H  6.020567 0.711991 -3.325813
H  -0.970915 -3.865963 0.153548
H  -0.848263 -2.32744 -0.762365
H  0.603806 -3.334441 -0.490881
H  -0.041726 -4.001065 2.573446
H  0.800018 -2.595328 3.28213
H  1.566381 -3.528383 1.958826
H  -0.33847 1.364611 -0.207749
H  -0.022806 2.688689 0.967506
H  -1.905315 2.208314 2.9786
H  -1.770455 -0.065226 -0.757511
H  -5.097752 2.744167 -0.453747
H  -3.257819 -1.690287 -1.908097
H  -6.578779 1.102114 -1.622091
