program: Gaussian 09
title: 000211278
version: EM64L-G09RevD.01
frameworkgroup: C1[X(C18H29ClN2O3)]
method: RPBEPBE
basis: SDD
operation: Freq
keyword: #p
keyword: freq=noraman
keyword: PBEPBE/SDD
title: #p freq=noraman PBEPBE/SDD
converged: YES YES NO NO
title: Mulliken charges:
elementType: Cl O O O N N C C C C C C C C C C C C C C C C C C H H H H H H H H H H H H H H H H H H H H H H H H H H H H H
charge: -0.061690 -0.246142 -0.441129 -0.318440 -0.092721 -0.124030 -0.348909 -0.388756 -0.343411 -0.329101 -0.418406 -0.332071 -0.128703 -0.319399 -0.326158 -0.359584 -0.319858 -0.682249 0.410765 -0.326635 -0.383953 -0.200096 -0.185817 -0.122704 0.225327 0.182983 0.212834 0.208830 0.194609 0.211570 0.190285 0.201892 0.220889 0.232311 0.189625 0.202928 0.217995 0.214512 0.190914 0.191459 0.213533 0.205344 0.196353 0.235249 0.235289 0.209740 0.209215 0.221226 0.349172 0.258946 0.254443 0.254203 0.257520
chargesum: 0.00000
title: Mulliken charges with hydrogens summed into heavy atoms:
elementType: Cl O O O N N C C C C C C C C C C C C C C C C C C
charge: -0.061690 -0.246142 -0.091956 -0.318440 -0.092721 -0.124030 0.059402 0.032907 0.062767 0.063076 0.034794 0.060482 0.089292 0.086028 0.078835 0.042112 0.150680 -0.042068 0.410765 -0.067689 -0.129510 0.054107 0.071703 -0.122704
polarizability: 2.78101367e+02 3.46231879e+01 2.05638266e+02 1.15960623e+00 -1.79305990e+00 1.96302444e+02
1716.lowfreq: -8.0885 -2.1942 0.0003 0.0012 0.0014 5.4095 11.2015 12.4830 22.8726
frequency: 9.9882 11.9604 22.7705 31.2905 35.7381 43.6277 58.8176 72.6897 75.7088 86.7235 99.1555 113.0338 145.6217 163.4843 184.7681 197.8059 222.0058 226.6513 232.9266 234.3581 264.7223 274.7969 312.7915 317.0024 331.5039 336.5946 350.1401 389.0747 410.0189 413.8362 416.4719 417.4548 439.7182 460.1646 467.7589 497.1588 505.4888 519.8124 554.7997 607.7153 623.5876 671.1216 693.4626 744.4254 764.1341 790.7939 801.6432 803.7160 810.1879 821.8181 835.8463 837.4004 843.9241 873.2342 898.3923 907.3877 915.2521 929.9939 943.8806 951.0827 986.5683 991.2732 997.5623 1027.9757 1034.8198 1046.4230 1052.1871 1056.2463 1067.0575 1071.4346 1084.8009 1089.4664 1103.5449 1109.3236 1109.5599 1121.5105 1127.6110 1136.1837 1159.7201 1173.6107 1191.8093 1194.7887 1215.4575 1221.2284 1235.8321 1239.3909 1253.0056 1256.6158 1267.3129 1272.3770 1289.0289 1291.3240 1292.5052 1297.6569 1311.6104 1326.9303 1329.3686 1337.0954 1347.7561 1351.9242 1365.7799 1369.0121 1371.2244 1372.8536 1375.3162 1380.2277 1391.4498 1397.8329 1403.9368 1442.8188 1445.9758 1449.2686 1452.2604 1459.0654 1467.1238 1470.5123 1475.3110 1477.1683 1478.3785 1478.8006 1484.5776 1489.7212 1585.4143 1603.6336 2855.9362 2858.8083 2864.4030 2875.0718 2907.3657 2927.2705 2952.8298 2956.5094 2974.7861 2981.9043 2982.6515 3010.6209 3018.1360 3024.3420 3034.4716 3036.4619 3036.7284 3047.7362 3053.6166 3056.1068 3071.2078 3077.4910 3079.1178 3082.6256 3155.8877 3159.5131 3176.1871 3179.8177 3539.5063
redmass: 5.0933 7.9895 3.4712 3.8174 3.8552 4.6759 4.0029 2.4706 2.1954 4.3449 5.6303 4.1760 7.3164 5.0057 2.5411 3.0252 1.8555 1.8943 2.1283 1.8057 5.8694 2.6931 3.5495 3.2198 3.3743 3.0547 6.5322 2.0660 1.8594 1.5050 3.0971 2.7789 3.5334 3.8333 2.8564 2.7225 3.4604 3.8064 3.8456 1.9249 7.0375 5.0749 3.5640 1.1063 3.3329 1.3490 2.7817 1.5333 3.3241 1.5613 2.4320 2.6250 2.1463 1.2535 2.1657 2.1597 2.2606 1.4365 2.9358 1.3638 2.5692 3.6080 2.8139 2.1911 2.6478 2.2658 2.3558 2.2037 2.3392 2.6067 2.9406 2.5120 1.8377 1.8230 1.6430 2.1945 2.2000 2.6572 1.7545 1.1750 1.2132 1.6349 1.6559 2.2725 1.3484 1.3819 1.3087 1.3955 1.3685 1.3126 1.2595 1.1585 1.1722 1.2897 1.4684 1.3620 1.3095 1.2452 1.3346 1.3457 1.6815 1.3549 1.7965 1.3293 1.8409 1.4051 1.2182 1.4000 3.7437 1.0822 1.0860 1.1558 1.0967 1.0946 1.0713 1.0875 1.5139 1.1180 1.0881 1.2135 1.0846 1.0840 7.5303 6.5707 1.0706 1.0698 1.0705 1.0691 1.0696 1.0687 1.0664 1.0665 1.0357 1.0549 1.0611 1.0875 1.0878 1.0892 1.0902 1.0885 1.0981 1.0909 1.0961 1.1037 1.1010 1.0991 1.0961 1.0978 1.0885 1.0882 1.0967 1.0973 1.0654
irintensity: 0.2524 0.0197 0.0761 0.0334 0.1686 0.3832 0.1609 0.0916 0.3507 0.0345 1.9226 0.4930 0.0951 7.1889 0.3982 6.6390 3.0937 5.1485 0.0881 2.2423 0.5113 0.5766 4.8105 5.3659 2.5464 3.8303 2.7764 1.0905 45.2029 111.1006 0.8259 0.2655 29.1883 21.5728 1.2298 22.2554 9.1412 6.7384 15.2369 4.7528 2.0822 28.4113 0.3253 8.1596 9.3840 2.6144 3.5140 6.9197 25.7851 83.1067 11.7982 14.1955 4.6160 1.7521 5.7316 2.7589 24.1043 8.7232 59.2586 0.6685 47.5424 31.0922 24.9569 9.8128 24.3049 37.2870 31.3166 1.3011 65.1448 41.4430 2.7580 21.4597 24.8100 9.9321 27.7938 7.0805 39.8672 32.1378 18.7868 49.7145 0.5637 10.9521 62.8761 202.4777 11.3672 8.4031 25.6933 4.8930 10.4602 10.6511 1.4170 5.1799 1.5308 3.0063 5.1063 12.4016 1.1636 8.0384 1.5823 2.2071 12.2010 0.2621 0.3002 4.9362 4.9847 37.8427 16.1840 1.3603 0.8889 2.5465 10.1721 121.9486 20.3097 2.9616 0.8054 5.5251 99.6831 5.2242 16.0408 38.1863 11.7373 14.1136 10.1652 22.3378 34.3666 45.3239 93.1301 115.6512 86.2390 92.4930 29.8760 112.5280 47.9023 22.9110 27.3922 14.8002 0.8942 39.9467 34.6642 7.8959 11.1211 40.2461 61.7012 33.8880 85.3183 40.0191 42.1997 31.7769 4.4102 4.8305 6.2128 1.2744 11.6455
temp: 298.150 k
press: 1.00000 atm
elementType: 17 8 8 8 7 7 6 6 6 6 6 6 6 6 6 6 6 6 6 6 6 6 6 6 1 1 1 1 1 1 1 1 1 1 1 1 1 1 1 1 1 1 1 1 1 1 1 1 1 1 1 1 1
symmnumber: 1
zpe: 1176838.9 jmol-1
zpe.correction: 0.448234 hartree
zpe.thermalcorrener: 0.474065 hartree
zpe.thermalcorrenthalpy: 0.475009 hartree
zpe.thermalcorrgfe: 0.387494 hartree
zpe.sumelectzpe: -1496.589098 hartree
zpe.sumelectthermal: -1496.563268 hartree
zpe.sumelectthermalent: -1496.562324 hartree
zpe.sumelectthermalfe: -1496.649839 hartree
dipole: -2.7441 -1.0505 0.6661
dipole: 3.0129
quadrupole: -157.4632 -177.1448 -147.9895
quadrupole: -3.9658 -9.5112 -10.7543
quadrupole: 3.4027 -16.2790 12.8763 -3.9658 -9.5112 -10.7543
hfenergy: -1497.0373327 hartree
pointgroup: C01 [X(C18H29Cl1N2O3)]
dipole: -0.9986054 0.5300685 0.356204 debye
polarizability: 268.6296311|-41.7064448|215.0414165|-7.7491437|1.3307426|196.3710285 unknown
InChI: InChI=1S/C18H29ClN2O3/c1-2-7-21(9-8-20-10-12-23-13-11-20)14-17(22)15-24-18-5-3-16(19)4-6-18/h3-6,17,22H,2,7-15H2,1H3
charge 0 multiplicity 1
53 atoms
Cl 4.054949 -5.025311 0.351419
O  3.955948 3.427643 0.321345
O  -3.521689 -1.660414 -2.140502
O  -0.914746 -1.945098 -1.123557
N  1.317639 2.305848 -0.189827
N  -2.360414 1.268546 -0.019315
C  0.1411 1.433642 0.042201
C  -1.196966 2.18477 -0.140102
C  2.557671 1.523302 -0.441696
C  1.547113 3.275166 0.913038
C  -2.627146 0.478132 -1.244966
C  -3.575321 1.911755 0.547046
C  -3.096961 -0.962716 -0.91771
C  3.720429 2.471733 -0.774402
C  2.727769 4.199043 0.571129
C  -3.51159 2.083233 2.080309
C  -2.033523 -1.770932 -0.168189
C  -4.768134 2.782698 2.642393
C  0.20574 -2.67794 -0.706883
C  0.355899 -3.236678 0.58669
C  1.22843 -2.836705 -1.675917
C  1.532116 -3.953787 0.906367
C  2.39988 -3.55092 -1.357155
C  2.536946 -4.101331 -0.065441
H  0.187961 0.604828 -0.68949
H  0.152631 0.966604 1.059943
H  -1.173471 2.714569 -1.121442
H  -1.296717 2.96109 0.639623
H  2.839419 0.900583 0.444655
H  2.382542 0.839145 -1.293892
H  1.761216 2.746372 1.877247
H  0.642059 3.89305 1.058577
H  -1.700455 0.411336 -1.843426
H  -3.40197 0.944978 -1.894487
H  -3.772282 2.905116 0.070625
H  -4.447694 1.27527 0.302651
H  -4.005466 -0.923692 -0.289936
H  4.666448 1.917401 -0.890492
H  3.492777 3.025907 -1.710793
H  2.475856 4.804005 -0.326893
H  2.966607 4.868003 1.414593
H  -3.387439 1.083607 2.53935
H  -2.610327 2.666159 2.355067
H  -2.42746 -2.765506 0.116784
H  -1.695284 -1.205769 0.721032
H  -4.890977 3.793503 2.209196
H  -5.684052 2.206382 2.411517
H  -4.70748 2.891896 3.740197
H  -2.698025 -1.921574 -2.629432
H  -0.420238 -3.123478 1.348045
H  1.091491 -2.402508 -2.670873
H  1.65734 -4.388414 1.902232
H  3.190947 -3.678942 -2.101454
