program: Gaussian 09
title: 000216578
version: EM64L-G09RevD.01
frameworkgroup: C1[X(C20H24ClNO2)]
method: RPBEPBE
basis: SDD
operation: Freq
keyword: #p
keyword: freq=noraman
keyword: PBEPBE/SDD
title: #p freq=noraman PBEPBE/SDD
converged: YES YES NO NO
title: Mulliken charges:
elementType: Cl O O N C C C C C C C C C C C C C C C C C C C C H H H H H H H H H H H H H H H H H H H H H H H H
charge: -0.059857 -0.305602 -0.271763 -0.088301 0.184795 -0.528247 0.167472 -0.412316 0.396395 -0.343082 0.173088 -0.264885 -0.315495 -0.397344 -0.375920 -0.384009 -0.338516 -0.278997 -0.103493 -0.253431 -0.243010 -0.241812 -0.614792 -0.612437 0.229944 0.249957 0.217057 0.230116 0.225369 0.237241 0.210369 0.217547 0.280702 0.252105 0.253920 0.219790 0.192054 0.279995 0.257635 0.228245 0.225453 0.228993 0.221865 0.228076 0.188608 0.221051 0.227038 0.188430
chargesum: 0.00000
title: Mulliken charges with hydrogens summed into heavy atoms:
elementType: Cl O O N C C C C C C C C C C C C C C C C C C C C
charge: -0.059857 -0.305602 -0.271763 -0.088301 0.184795 -0.048346 0.167472 0.034857 0.396395 0.119528 0.173088 0.163031 -0.034793 -0.145239 -0.122000 0.027835 -0.058520 -0.021363 -0.103493 -0.025186 -0.017557 -0.012818 0.023757 0.024081
polarizability: 2.46956987e+02 -3.00821695e+01 2.66625034e+02 1.29376189e+00 -3.41093103e+00 1.94605336e+02
1716.lowfreq: -9.3150 -6.7642 -0.0005 0.0011 0.0022 5.9883 13.0914 19.4945 33.0197
frequency: 12.7369 19.2694 32.9597 43.0176 52.2012 68.8168 92.4743 100.1256 113.0915 150.2748 169.5701 175.1498 181.5769 194.1336 210.7045 223.9516 242.5902 246.8033 260.0169 281.5870 300.6246 319.5777 333.9837 356.4631 361.0418 380.8002 405.5754 420.7796 447.8905 463.5794 470.0197 489.7419 534.0289 562.1401 579.7277 604.2533 616.7154 619.8994 651.6000 682.9413 706.9212 731.6921 757.9677 769.0596 809.7109 812.3830 815.4118 823.2023 855.0137 858.0810 875.0576 888.2144 894.3544 932.6866 951.6946 963.5924 980.4433 983.9247 990.7194 995.9544 1005.6083 1027.7654 1031.3112 1032.8838 1038.8047 1069.7178 1070.3495 1082.3905 1085.4570 1092.1810 1096.7944 1101.7763 1123.3088 1137.8765 1165.4123 1171.3830 1172.6303 1186.0987 1191.7817 1195.1763 1235.0518 1237.0309 1251.9053 1252.5739 1266.3171 1280.0809 1288.3374 1317.2422 1327.5976 1337.7823 1355.4769 1361.4380 1371.1106 1379.6434 1381.8901 1389.5110 1418.4739 1433.9184 1441.8352 1457.4669 1460.5706 1460.8931 1464.3606 1472.8314 1474.5203 1476.1034 1476.3090 1480.9813 1484.6430 1490.8260 1565.6912 1590.2411 1595.7198 1611.1881 2847.7040 2854.5229 2870.8793 2966.6591 2992.1075 3005.0041 3011.3206 3018.4345 3024.0922 3029.8460 3047.6288 3048.2566 3068.1351 3077.7766 3086.8840 3091.1006 3122.5544 3130.8563 3143.6338 3149.3141 3154.5913 3166.1134 3176.7716 3182.8634
redmass: 2.5766 4.9105 4.3581 6.0576 4.4761 4.3163 2.5799 3.3102 3.4547 3.3279 3.3102 2.8251 5.9927 3.7444 1.2094 3.2517 1.9603 1.9439 3.7868 4.3984 3.1198 4.2337 3.8488 2.5665 3.7988 4.7058 2.8546 2.6458 4.5569 3.5827 3.8597 4.1914 3.4601 4.7319 4.7152 3.6686 5.9685 4.4932 5.5202 5.5992 1.7238 3.7761 1.9077 1.9995 2.3436 1.2570 1.6122 3.8332 1.7619 1.6778 1.5007 3.5311 3.2127 1.5601 3.9691 1.3531 1.4017 7.8426 5.1421 1.4381 2.4554 2.2884 2.1281 1.5465 2.9798 1.6680 1.8811 1.7158 1.7381 1.5770 2.1611 2.1266 2.4581 1.4365 1.4333 1.6300 1.0549 1.6127 1.2617 3.5156 1.7478 1.3395 1.3708 1.8381 2.5800 1.3383 1.2303 1.3455 1.3512 1.3748 1.5417 1.8043 3.9767 7.1609 1.4366 2.2601 1.1430 2.2226 1.1657 1.8771 1.0475 1.1985 1.0665 1.1170 1.0591 1.0805 1.1562 2.1099 1.0579 1.0807 8.9865 6.1777 6.9409 6.0990 1.0572 1.0624 1.0645 1.0554 1.0591 1.0612 1.0629 1.0724 1.0939 1.0752 1.0973 1.1000 1.1025 1.1009 1.1005 1.1056 1.0845 1.0879 1.0927 1.0887 1.0955 1.1004 1.0958 1.0930
irintensity: 0.7731 0.1419 0.1347 0.0078 0.4476 0.2840 1.7461 1.3315 2.1281 0.8062 0.3571 0.9010 1.9758 0.5769 1.8318 0.6636 1.5913 1.0753 1.4884 2.1811 4.3333 6.8795 4.7258 5.9708 2.9308 5.5292 0.5714 3.3431 7.3551 1.3696 6.2895 10.5231 13.3071 10.0168 1.8775 10.2102 0.2126 3.3523 1.9162 6.0270 44.6219 5.9978 6.4036 49.6426 30.6677 25.4567 16.0017 7.2306 2.2748 3.7048 21.6905 12.1639 12.9051 1.2084 170.5324 8.0476 2.0042 154.5269 1.1918 0.9589 6.4704 10.6830 56.4444 10.0553 23.7661 4.3656 15.7527 2.3754 15.2423 5.4882 9.5805 6.5409 23.0603 3.2669 5.3513 3.9253 0.0579 8.6695 5.3240 50.5312 7.1203 9.0271 2.0350 32.8385 10.3917 8.5556 7.8706 1.7029 2.7212 21.5492 28.2983 26.1838 1.3649 1.8167 1.7502 16.6341 2.2406 14.5779 3.3206 73.7546 13.0861 6.6227 2.1711 13.8932 28.2352 18.2111 9.8191 18.5238 14.6881 5.2301 42.6759 1.1034 99.0760 4.0788 75.7569 81.1655 170.5050 34.5342 26.1831 33.3604 27.4855 42.3329 31.2499 32.0684 50.6218 15.1579 32.8141 33.1975 50.5548 38.0145 1.3607 3.6217 26.9763 0.4655 29.4759 18.1853 2.0130 0.1191
temp: 298.150 k
press: 1.00000 atm
elementType: 17 8 8 7 6 6 6 6 6 6 6 6 6 6 6 6 6 6 6 6 6 6 6 6 1 1 1 1 1 1 1 1 1 1 1 1 1 1 1 1 1 1 1 1 1 1 1 1
symmnumber: 1
zpe: 1035390.9 jmol-1
zpe.correction: 0.394360 hartree
zpe.thermalcorrener: 0.417662 hartree
zpe.thermalcorrenthalpy: 0.418606 hartree
zpe.thermalcorrgfe: 0.339386 hartree
zpe.sumelectzpe: -1439.954859 hartree
zpe.sumelectthermal: -1439.931557 hartree
zpe.sumelectthermalent: -1439.930613 hartree
zpe.sumelectthermalfe: -1440.009832 hartree
dipole: 1.4894 -2.3717 0.2681
dipole: 2.8134
quadrupole: -136.3647 -156.1533 -148.5342
quadrupole: 4.4333 3.4220 0.8144
quadrupole: 10.6527 -9.1359 -1.5168 4.4333 3.4220 0.8144
hfenergy: -1440.3492184 hartree
pointgroup: C01 [X(C20H24Cl1N1O2)]
dipole: 0.7096611 -0.8439264 -0.0966642 debye
polarizability: 247.2538954|-30.1759948|266.3965362|-1.9991885|2.1208476|194.5369263 unknown
InChI: InChI=1S/C20H24ClNO2/c1-22(2)12-14-24-20(16-7-4-3-5-8-16)11-6-13-23-19-15-17(21)9-10-18(19)20/h3-5,7-10,15H,6,11-14H2,1-2H3
charge 0 multiplicity 1
48 atoms
Cl -4.143165 3.388508 0.867587
O  1.588985 0.004984 0.072641
O  -2.142055 -0.146186 -2.293859
N  3.620348 3.125695 -0.253022
C  0.353903 -0.669154 -0.457856
C  0.56481 -0.920074 -1.980946
C  -0.858859 0.24202 -0.162289
C  -0.403403 -1.925313 -2.640231
C  0.330931 -1.995089 0.328242
C  -1.875612 -1.609302 -2.332271
C  -1.942551 0.494799 -1.053665
C  1.969821 1.276091 -0.575482
C  -0.856089 0.946055 1.072918
C  -0.820771 -2.460667 1.006864
C  1.505827 -2.791655 0.356175
C  3.016133 1.91614 0.351018
C  -2.935098 1.460273 -0.741896
C  -1.839585 1.894766 1.412194
C  -2.862084 2.148343 0.475289
C  -0.807118 -3.700906 1.686379
C  1.522568 -4.028353 1.034676
C  0.362505 -4.492162 1.69984
C  2.70716 4.287847 -0.267942
C  4.924612 3.46454 0.352237
H  1.600112 -1.287005 -2.10806
H  0.490299 0.044956 -2.513906
H  -0.229521 -1.902152 -3.732085
H  -0.186583 -2.953244 -2.291318
H  -2.544083 -1.984436 -3.124517
H  -2.185216 -2.046289 -1.365159
H  1.078369 1.923478 -0.696169
H  2.423373 1.096643 -1.569491
H  -0.026454 0.755224 1.761574
H  -1.727843 -1.846605 1.025851
H  2.412857 -2.421568 -0.131818
H  3.815731 1.170918 0.516836
H  2.548081 2.120684 1.34734
H  -3.744818 1.628127 -1.456082
H  -1.805935 2.428357 2.365497
H  -1.707538 -4.042642 2.209246
H  2.440066 -4.627651 1.051344
H  0.374815 -5.452226 2.227998
H  3.194286 5.132104 -0.78766
H  1.781289 4.046504 -0.816963
H  2.419808 4.631552 0.759037
H  5.373346 4.316824 -0.189402
H  5.612129 2.604662 0.264418
H  4.856321 3.744782 1.434687
