program: Gaussian 09
title: 000015187
version: EM64L-G09RevD.01
frameworkgroup: C1[X(C23H16O4)]
method: RPBEPBE
basis: SDD
operation: Freq
keyword: #pfreq=noraman
keyword: PBEPBE/SDD
title: #p freq=noraman PBEPBE/SDD
converged: YES YES NO NO
title: Mulliken charges:
elementType: O O O O C C C C C C C C C C C C C C C C C C C C C C C H H H H H H H H H H H H H H H H
charge: -0.242137 -0.275496 -0.184711 -0.218544 0.246094 0.179534 -0.062122 0.206337 0.282101 0.314861 -0.338009 0.055072 -0.557941 0.382029 -0.366769 -0.421940 -0.380879 -0.381872 -0.369509 -0.231384 -0.221151 -0.233332 -0.241209 -0.239262 -0.241130 0.262111 -0.746980 0.268847 0.292938 0.304647 0.262848 0.254090 0.246258 0.254540 0.232742 0.231852 0.227150 0.227981 0.232974 0.228593 0.256095 0.248586 0.256097
chargesum: 0.00000
title: Mulliken charges with hydrogens summed into heavy atoms:
elementType: O O O O C C C C C C C C C C C C C C C C C C C C C C C
charge: -0.242137 -0.275496 -0.184711 -0.218544 0.246094 0.179534 -0.062122 0.206337 0.282101 0.314861 -0.069163 0.055072 -0.265003 0.382029 -0.062122 -0.159092 -0.126788 -0.135615 -0.114968 0.001358 0.010701 -0.006182 -0.013228 -0.006288 -0.012537 0.262111 0.013797
polarizability: 4.34038998e+02 1.82393738e+01 2.76720015e+02 -9.90995718e+00 -1.60322192e+01 1.54363496e+02
1716.lowfreq: -5.2424 -3.4785 -0.0006 -0.0004 0.0006 2.4462 19.9637 28.6935 45.7931
frequency: 19.9085 28.6785 45.7394 49.5143 57.9847 62.6808 66.6263 71.7252 79.7558 100.8628 130.2994 153.6382 193.0776 205.3297 218.6982 251.8983 254.4699 259.7901 300.3569 324.3748 343.8760 380.7665 401.2626 401.5589 421.2807 451.8769 462.3762 487.5033 509.1687 519.5344 551.4959 574.4510 600.5102 608.1141 615.1813 616.3075 639.2161 645.9402 663.7240 682.1424 698.1835 704.0937 712.9840 729.2914 746.4118 762.8861 778.7872 815.5325 844.1505 845.4959 846.7786 859.8120 868.6466 887.9276 916.1278 925.2399 933.2471 970.3534 973.1641 978.5970 985.3053 988.7068 989.8171 994.1659 994.7524 999.3422 1025.8292 1028.2342 1040.4203 1072.2518 1083.3322 1088.8129 1105.3259 1156.0966 1164.8004 1173.5964 1174.6540 1183.2472 1191.5633 1196.2109 1232.9304 1250.8935 1280.4820 1313.4091 1318.2685 1345.2690 1370.7741 1374.6634 1384.9299 1394.0392 1422.6399 1430.9771 1432.9995 1451.3979 1452.5769 1475.1696 1483.0788 1488.1666 1532.0937 1569.1514 1582.3074 1586.5166 1608.9349 1609.6319 1614.9746 1657.0152 1666.1057 3009.5436 3097.3137 3125.6545 3125.9857 3132.8825 3136.5197 3144.4064 3146.1810 3149.9238 3154.4303 3160.5755 3166.0049 3168.5774 3171.4763 3189.5168 3217.4440
redmass: 7.4382 5.1386 4.3745 4.4901 4.2245 4.4215 2.5188 1.7110 3.3482 6.2248 5.2765 6.0090 7.7348 5.1728 4.9913 6.4954 6.9709 5.7291 6.5052 5.8381 4.3380 7.1261 2.8243 2.8499 5.8821 6.2869 3.6041 4.7075 4.7918 4.1704 3.1215 6.2950 7.1630 7.2494 6.4383 6.1991 6.4328 4.9637 6.9980 6.7935 1.8448 1.8858 3.8144 5.1671 2.9058 2.3843 2.6949 6.4186 1.7053 2.0836 1.6086 1.2662 6.7926 1.5393 3.0688 1.6181 1.7257 3.3496 1.4245 1.3694 1.3654 5.7034 4.7826 1.4865 1.8073 1.3120 2.6127 2.2134 1.6415 2.7513 1.6326 1.9759 2.2667 1.9108 3.6618 1.0626 1.0553 2.2745 1.1177 1.1201 5.7939 1.9458 2.1578 1.4743 1.4219 2.9314 6.8544 6.7060 1.2580 6.9427 4.2500 2.3441 2.2843 1.0604 1.0463 2.3448 2.4592 3.0190 8.8669 8.4131 5.8920 6.5446 6.0842 6.1110 7.5096 11.7186 9.8102 1.0368 1.0973 1.0859 1.0847 1.0874 1.0885 1.0923 1.1012 1.0933 1.0965 1.0968 1.0908 1.1014 1.0998 1.0931 1.0945
irintensity: 0.0952 5.8021 0.0142 0.2906 0.3417 0.5122 0.2889 0.2726 0.4042 1.0250 2.4834 0.8334 1.4207 0.5973 0.9186 0.5891 1.4573 0.4445 3.7418 0.4924 1.2934 0.6487 0.6054 0.5878 2.3311 6.9681 3.4681 4.8265 9.7951 2.9858 1.7782 7.4234 1.8650 32.7389 2.9234 3.1170 25.3210 1.7201 7.1999 8.2672 46.6377 42.0245 8.9427 36.4149 10.6803 36.6501 21.6074 67.8681 19.7312 2.2250 2.6862 3.4377 5.2814 48.4445 20.2878 5.6653 16.6762 76.9323 1.0199 1.8804 0.7558 1.9680 9.4616 82.4666 202.2328 0.4822 1.9333 7.7527 9.1921 43.9453 1.7275 13.6166 224.4262 1.5083 695.2157 8.5325 2.1249 117.6354 2.0764 0.7260 57.3044 21.8287 21.5282 7.3018 8.0757 85.9162 2.5357 0.5730 63.4919 41.4389 19.5489 10.1686 20.9445 21.5865 19.2973 22.3543 20.8218 24.1350 52.8673 44.4914 2.4871 5.2732 9.3098 1.0575 328.1380 295.6264 206.1118 0.5966 5.2322 3.0550 0.4830 0.7074 6.2820 15.2171 12.0920 30.5265 24.1564 26.0171 1.4883 20.4228 14.5492 1.1744 4.5972
temp: 298.150 k
press: 1.00000 atm
elementType: 8 8 8 8 6 6 6 6 6 6 6 6 6 6 6 6 6 6 6 6 6 6 6 6 6 6 6 1 1 1 1 1 1 1 1 1 1 1 1 1 1 1 1
symmnumber: 1
zpe: 846428.0 jmol-1
zpe.correction: 0.322387 hartree
zpe.thermalcorrener: 0.345072 hartree
zpe.thermalcorrenthalpy: 0.346016 hartree
zpe.thermalcorrgfe: 0.267949 hartree
zpe.sumelectzpe: -1185.113743 hartree
zpe.sumelectthermal: -1185.091058 hartree
zpe.sumelectthermalent: -1185.090114 hartree
zpe.sumelectthermalfe: -1185.168181 hartree
dipole: 0.9379 3.8852 0.1557
dipole: 3.9998
quadrupole: -125.0282 -165.6411 -149.2620
quadrupole: -20.3237 -4.0828 -5.1623
quadrupole: 21.6156 -18.9973 -2.6183 -20.3237 -4.0828 -5.1623
hfenergy: -1185.4361301 hartree
pointgroup: C01 [X(C23H16O4)]
dipole: 0.2450994 1.5482376 -0.1389077 debye
polarizability: 429.2906462|27.9410004|274.4410245|-20.332326|-32.5898141|161.3908384 unknown
InChI: InChI=1S/C23H16O4/c1-15(24)26-18-12-13-19-20(14-18)27-23(25)22(17-10-6-3-7-11-17)21(19)16-8-4-2-5-9-16/h2-14H,1H3
charge 0 multiplicity 1
43 atoms
O  0.923218 -2.371188 0.246547
O  5.163614 -0.292043 -0.098697
O  -1.012805 -3.542615 0.56456
O  5.920163 1.934243 -0.312382
C  -0.546455 0.073085 0.075854
C  0.91753 0.077053 0.033771
C  -1.241989 -1.133038 0.212805
C  1.611334 -1.167451 0.099312
C  -1.267429 1.386443 0.013947
C  -2.734274 -1.234285 0.181805
C  1.717845 1.253727 -0.041704
C  -0.519626 -2.415948 0.366668
C  3.012651 -1.252341 0.045188
C  3.759168 -0.063686 -0.056517
C  3.120612 1.206941 -0.089769
C  -1.137926 2.239975 -1.113822
C  -2.079362 1.805037 1.100458
C  -3.477223 -0.631014 -0.869012
C  -3.436281 -1.95638 1.184185
C  -1.816123 3.477893 -1.159604
C  -2.745713 3.048236 1.060232
C  -4.883602 -0.731987 -0.908083
C  -4.844151 -2.047039 1.150707
C  -2.61976 3.888354 -0.070716
C  -5.574612 -1.435057 0.105903
C  6.156592 0.714693 -0.223852
C  7.51397 0.051531 -0.230639
H  1.223846 2.228952 -0.05334
H  3.508817 -2.224099 0.092973
H  3.708991 2.121753 -0.149479
H  -0.522984 1.923483 -1.964312
H  -2.188045 1.152273 1.972999
H  -2.949843 -0.092743 -1.663134
H  -2.87895 -2.45421 1.983053
H  -1.716331 4.119023 -2.042345
H  -3.366026 3.3582 1.908228
H  -5.437954 -0.266656 -1.730626
H  -5.369256 -2.603728 1.934719
H  -3.142659 4.850494 -0.103651
H  -6.667257 -1.513066 0.076927
H  7.657935 -0.529372 0.696655
H  8.297507 0.817444 -0.317883
H  7.586343 -0.656686 -1.074129
