program: Gaussian 09
title: 000216567
version: EM64L-G09RevD.01
frameworkgroup: C1[X(C16H18N2O5)]
method: RPBEPBE
basis: SDD
operation: Freq
keyword: #p
keyword: freq=noraman
keyword: PBEPBE/SDD
title: #p freq=noraman PBEPBE/SDD
converged: YES YES NO NO
title: Mulliken charges:
elementType: O O O O O N N C C C C C C C C C C C C C C C C H H H H H H H H H H H H H H H H H H
charge: -0.282341 -0.197505 -0.179519 -0.218791 -0.234704 -0.369751 -0.374195 -0.300982 0.098364 -0.396885 0.509092 0.175047 0.198290 -0.703476 -0.361374 -0.456821 0.156740 0.349029 -0.233639 -0.223114 -0.508980 -0.240363 -0.661818 0.231104 0.230014 0.250010 0.222973 0.237570 0.205226 0.248786 0.229268 0.367701 0.367575 0.224587 0.226703 0.251363 0.249238 0.229270 0.236278 0.219138 0.230893
chargesum: 0.00000
title: Mulliken charges with hydrogens summed into heavy atoms:
elementType: O O O O O N N C C C C C C C C C C C C C C C C
charge: -0.282341 -0.197505 -0.179519 -0.218791 -0.234704 -0.002049 -0.006620 -0.069878 0.098364 0.083139 0.509092 0.175047 0.198290 -0.037708 -0.112588 -0.227553 0.156740 0.349029 -0.009053 0.003588 -0.008379 -0.011093 0.024491
polarizability: 2.06367467e+02 -1.67916364e+00 2.18850246e+02 -2.38122595e+01 1.66096954e+00 1.67240512e+02
1716.lowfreq: -6.9551 -5.7984 -0.6471 -0.0004 0.0005 0.0007 25.3096 35.4789 37.5344
frequency: 24.7770 35.3018 37.4958 46.6331 58.5260 65.7769 68.4193 86.0301 112.3939 142.2154 153.3748 162.5956 166.4092 185.3095 193.5649 211.5491 218.5851 229.2067 255.2792 281.4532 309.6844 319.7244 362.3194 364.1122 397.3010 403.3181 477.4286 479.0324 500.8884 534.8063 546.3071 577.3013 615.4649 619.8770 627.9208 642.2323 648.3235 681.6299 700.7033 714.5154 737.1081 748.9842 762.5451 775.5841 782.6651 795.0610 833.2624 851.0823 853.4901 903.3807 926.4690 974.0349 975.5577 987.5457 990.9440 996.1035 1003.0673 1012.5394 1024.5888 1027.7682 1047.9587 1073.2839 1077.3069 1086.9362 1091.9016 1118.2356 1127.7358 1173.1832 1191.4835 1192.7383 1206.3555 1242.2459 1244.6048 1285.8406 1299.0152 1306.7914 1334.6227 1342.4620 1351.3133 1354.9646 1376.7877 1378.9204 1386.2882 1391.1183 1402.3721 1441.0626 1444.2148 1473.2599 1474.3359 1477.3366 1481.7952 1482.3953 1486.9867 1593.4297 1612.9164 1630.5863 1650.0851 1668.3996 1676.3130 2975.6995 2978.7033 2995.4578 3002.7137 3016.8942 3048.7305 3059.5092 3079.8175 3089.3073 3100.4982 3106.9336 3112.6114 3127.8770 3140.7895 3154.8184 3166.9803 3521.1716 3523.1728
redmass: 4.0496 2.7596 3.9193 5.2483 3.1803 2.7545 4.4164 3.6834 7.2778 5.1577 4.7342 4.9922 4.4312 1.8446 1.5887 3.2608 4.4323 4.2234 1.8110 3.9174 6.5121 9.1904 9.9929 10.4175 3.0972 2.7948 8.6244 5.3910 6.6881 3.3181 2.8574 4.7967 6.4978 6.5028 3.5726 3.6519 3.9034 3.0654 2.0277 2.5088 1.7930 2.4414 2.9773 1.8696 2.4231 1.3754 2.0110 1.4563 2.8345 2.0154 1.6106 4.4913 1.4633 3.7724 5.0030 1.3881 2.5552 3.1034 2.9269 2.7887 2.5143 1.9567 2.4570 1.6517 1.9758 2.3047 2.7611 1.0584 1.8543 2.0525 2.2407 1.3925 1.1741 1.6210 2.7482 1.3074 1.3994 1.7444 1.4309 8.8061 1.9876 1.4072 4.9980 1.2203 1.2091 1.0878 2.1128 1.0387 1.0461 1.0726 1.0921 1.8855 1.1191 5.9871 6.1174 7.6435 9.6766 11.5007 5.1547 1.0822 1.0370 1.0619 1.0367 1.0608 1.0969 1.0990 1.0996 1.1014 1.1006 1.1005 1.0879 1.0863 1.0919 1.0954 1.1006 1.0759 1.0782
irintensity: 0.1122 0.0299 0.1936 0.4994 2.0453 0.5496 1.2358 0.3375 0.9784 0.2518 1.6367 3.0998 8.1623 0.7829 0.9743 0.0546 0.3116 0.3609 0.5875 1.5774 34.8675 3.4262 11.5087 18.4939 0.3888 0.2873 11.7799 9.3815 12.5178 13.1384 2.6356 3.6498 0.1742 0.4270 2.2609 11.9385 2.0283 29.6676 33.4377 59.9093 21.5450 4.4331 33.0429 73.7101 109.1641 14.7855 9.3745 4.5140 32.4154 4.3865 0.6805 16.4664 0.8438 1.4917 0.7511 0.2499 1.1395 7.0991 58.0847 81.3355 39.9984 42.4478 42.3895 1.4046 18.4443 91.5109 113.5017 0.0954 13.8580 17.2033 5.1245 0.0588 0.1688 104.4561 199.9467 0.9064 9.4880 45.8813 1.2564 245.4285 1.0324 1.8698 1.0114 10.4327 16.8492 28.6884 14.3291 13.8929 9.8680 2.6144 12.6207 10.1161 18.1641 1.0116 1.3229 293.1337 189.3015 34.3123 605.2753 11.7791 34.0021 17.0976 23.0259 9.4376 2.2169 5.3858 32.4209 40.7086 25.6958 23.7761 9.1894 0.2210 21.8630 30.1198 15.8593 89.9134 51.5071
temp: 298.150 k
press: 1.00000 atm
elementType: 8 8 8 8 8 7 7 6 6 6 6 6 6 6 6 6 6 6 6 6 6 6 6 1 1 1 1 1 1 1 1 1 1 1 1 1 1 1 1 1 1
symmnumber: 1
zpe: 837977.1 jmol-1
zpe.correction: 0.319169 hartree
zpe.thermalcorrener: 0.341613 hartree
zpe.thermalcorrenthalpy: 0.342557 hartree
zpe.thermalcorrgfe: 0.265965 hartree
zpe.sumelectzpe: -1104.485213 hartree
zpe.sumelectthermal: -1104.462769 hartree
zpe.sumelectthermalent: -1104.461825 hartree
zpe.sumelectthermalfe: -1104.538417 hartree
dipole: 2.0337 -2.0060 1.1343
dipole: 3.0735
quadrupole: -132.4834 -130.7718 -139.1665
quadrupole: 7.3787 -2.7093 3.2686
quadrupole: 1.6572 3.3687 -5.0259 7.3787 -2.7093 3.2686
hfenergy: -1104.8043817 hartree
pointgroup: C01 [X(C16H18N2O5)]
dipole: 1.009743 -0.4481178 0.4917317 debye
polarizability: 208.5861642|-7.3614554|214.9302768|-22.5370154|-10.6958006|168.9417836 unknown
InChI: InChI=1S/C16H18N2O5/c1-3-11(10-8-6-5-7-9-10)16(23-12(19)4-2)13(20)17-15(22)18-14(16)21/h5-9,11,17-18H,3-4H2,1-2H3
charge 0 multiplicity 1
41 atoms
O  -0.636054 -1.391832 0.497673
O  -2.393497 0.310732 1.942697
O  -0.02064 -0.494146 -2.093122
O  -2.250534 3.524265 -1.416869
O  -2.660501 -1.439782 -0.647503
N  -2.219036 1.942034 0.304332
N  -0.977596 1.578976 -1.67746
C  0.702964 0.622407 0.961633
C  -0.602137 0.05286 0.249415
C  0.800899 0.116133 2.431823
C  1.984458 0.355447 0.169191
C  -1.836641 0.726863 0.899914
C  -0.523588 0.307374 -1.276604
C  1.841889 0.916872 3.242721
C  2.483608 -0.960508 -0.010189
C  2.715342 1.441284 -0.373611
C  -1.834927 2.431751 -0.959875
C  -1.761529 -2.060047 -0.041773
C  3.685647 -1.180702 -0.715044
C  3.92175 1.223841 -1.077643
C  -1.673815 -3.545774 0.220208
C  4.41098 -0.090147 -1.250163
C  -2.967938 -4.292712 -0.149878
H  0.552649 1.721719 0.992577
H  1.070668 -0.954448 2.423778
H  -0.188144 0.185369 2.919034
H  1.898085 0.536247 4.278386
H  2.849325 0.840301 2.796618
H  1.573325 1.989329 3.294263
H  1.919044 -1.810381 0.386226
H  2.343331 2.465082 -0.239004
H  -2.942537 2.486245 0.785408
H  -0.794638 1.85088 -2.648911
H  4.055377 -2.202947 -0.853097
H  4.476342 2.075494 -1.487245
H  -0.814302 -3.929743 -0.364628
H  -1.406873 -3.692718 1.283268
H  5.344635 -0.263469 -1.796794
H  -3.228659 -4.129657 -1.209043
H  -2.842318 -5.376332 0.01808
H  -3.817211 -3.941661 0.460716
