program: Gaussian 09
title: 000211268
version: EM64L-G09RevD.01
frameworkgroup: C1[X(C17H27ClN2O3)]
method: RPBEPBE
basis: SDD
operation: Freq
keyword: #p
keyword: freq=noraman
keyword: PBEPBE/SDD
title: #p freq=noraman PBEPBE/SDD
converged: YES YES NO NO
title: Mulliken charges:
elementType: Cl O O O N N C C C C C C C C C C C C C C C C C H H H H H H H H H H H H H H H H H H H H H H H H H H H
charge: -0.044453 -0.247899 -0.442470 -0.302393 -0.095852 -0.121947 -0.360763 -0.378830 -0.348345 -0.350814 -0.419437 -0.318495 -0.315148 -0.326075 -0.128813 -0.315023 -0.673369 0.528997 -0.322647 -0.332371 -0.208695 -0.227799 -0.243114 0.220229 0.207341 0.203969 0.217571 0.202237 0.206038 0.208408 0.194094 0.230923 0.230050 0.189737 0.213325 0.211271 0.190081 0.196286 0.207968 0.216721 0.233844 0.237888 0.210172 0.214401 0.217884 0.353914 0.257211 0.257487 0.230711 0.235991
chargesum: 0.00000
title: Mulliken charges with hydrogens summed into heavy atoms:
elementType: Cl O O O N N C C C C C C C C C C C C C C C C C
charge: -0.044453 -0.247899 -0.088556 -0.302393 -0.095852 -0.121947 0.066807 0.042710 0.059930 0.051687 0.041537 0.084567 0.086204 0.078179 0.087908 0.156709 -0.030911 0.528997 -0.322647 -0.075160 0.048792 0.002912 -0.007123
polarizability: 1.86540493e+02 -9.31174863e+00 2.43997821e+02 -1.78475217e+01 -9.73607483e+00 2.08157497e+02
1716.lowfreq: -7.8605 -7.0061 -0.0023 -0.0013 -0.0002 6.4615 12.2394 13.6083 27.9014
frequency: 11.0437 13.0946 27.8721 29.6256 33.2021 56.2846 68.8360 73.9808 82.5952 114.3578 125.7636 156.5413 160.7021 167.3829 191.2707 223.7657 231.6140 239.5258 247.3186 262.1004 287.4393 309.5357 327.3239 350.3789 380.6756 386.8089 394.3915 413.4874 428.9099 438.1492 448.2771 460.4047 468.8628 479.3459 521.7605 537.5501 547.0376 602.2027 622.8587 679.3495 705.5819 751.1919 754.2980 781.9433 796.5563 797.6666 806.0190 820.0627 835.7268 839.8258 841.8441 894.8172 918.1537 927.9861 940.6990 958.7194 970.9750 992.0613 997.8541 1019.3792 1027.7833 1033.8961 1040.1622 1050.3142 1052.0695 1065.5896 1070.6541 1087.6569 1094.7791 1104.2331 1109.7154 1129.2202 1130.4234 1134.0872 1163.4383 1171.2815 1189.1172 1190.8575 1219.3972 1229.8782 1233.1055 1244.4598 1260.9158 1265.1897 1269.6064 1280.4921 1284.6589 1292.0411 1297.8813 1321.3679 1328.9035 1334.3568 1348.8377 1351.0274 1363.1392 1366.9441 1369.1975 1372.5029 1381.7830 1384.8184 1386.6384 1394.4762 1428.8292 1440.8652 1445.9446 1446.9034 1448.4760 1457.6911 1460.9063 1471.1841 1471.8898 1474.0118 1479.5179 1488.2642 1488.5086 1575.0254 1604.8740 2863.3352 2869.7302 2874.6522 2889.6543 2896.4334 2921.1226 2951.3259 2955.7759 2983.6830 2984.5398 3021.3684 3023.4811 3029.8446 3032.6024 3040.4521 3056.4387 3059.6201 3063.3653 3077.6597 3078.6779 3081.6805 3088.5756 3140.1287 3155.8133 3167.4573 3178.6122 3532.9960
redmass: 5.9310 4.5561 4.8472 4.9743 4.3559 3.8701 4.1224 3.1994 4.6245 3.7513 3.5727 5.9580 1.6979 4.3729 2.9878 2.6159 3.0085 1.8463 2.4726 5.3146 2.5236 2.5812 2.6301 3.2991 10.2652 2.0693 2.2656 2.6461 1.3135 3.0592 3.2505 3.0579 2.7538 3.7034 3.8625 3.8888 4.1069 1.9218 4.6525 5.6858 3.6953 1.2692 3.1956 1.5271 2.1428 1.5063 3.4609 2.7692 1.9644 1.6055 1.8624 2.3566 2.2526 1.4729 3.1969 2.6744 1.3148 2.1678 2.6401 7.3920 2.2020 2.3739 2.0040 2.4431 1.9738 2.5147 2.2593 3.0100 2.3748 2.0409 2.1206 1.7105 1.9217 2.5734 1.6963 1.0643 1.5824 1.2777 1.4705 1.6850 1.3638 1.7756 1.2954 1.5326 1.3092 1.4979 1.2132 1.2838 1.2026 1.3275 1.4113 1.2343 1.3116 1.3393 1.3938 1.3250 1.2763 1.5267 3.8678 1.2773 1.2967 1.4100 2.3099 1.0831 1.2055 1.0849 1.0956 1.0827 1.0677 1.1462 1.1596 1.6254 1.0806 1.0725 1.0887 6.3681 7.1814 1.0699 1.0714 1.0696 1.0708 1.0685 1.0691 1.0664 1.0664 1.0360 1.0541 1.0879 1.0900 1.0883 1.0901 1.0863 1.0915 1.1075 1.0916 1.0963 1.0984 1.0976 1.1004 1.0858 1.0900 1.0943 1.1004 1.0654
irintensity: 0.5905 0.0851 0.8835 0.0885 0.2010 0.5715 0.5765 0.5237 0.7041 0.2183 1.3257 1.1617 0.7997 7.9435 7.1302 0.8869 0.6884 1.5787 1.1120 0.4395 7.7439 1.0430 9.3128 1.3530 1.5615 0.0380 2.8157 5.6542 115.1743 6.5274 15.6301 45.0841 1.0015 10.0477 4.7651 1.2976 10.3618 6.1998 3.7778 16.5838 0.4853 111.1706 9.8649 5.7487 3.2434 4.5494 18.4731 6.2663 7.5923 0.3360 11.0998 6.1620 20.9521 9.6724 64.0832 13.2141 0.3595 28.4791 36.3053 45.2941 3.8539 46.8157 21.9845 18.5741 13.9913 49.4018 13.2308 26.6221 25.2787 13.8147 25.3564 5.3506 22.0578 45.8091 28.5125 5.5989 6.4342 7.8218 20.1456 137.9540 7.1873 38.9207 6.4225 50.7263 5.8586 29.3936 19.6443 4.3871 2.7902 4.0379 7.3044 2.3314 4.2729 2.0676 0.8986 9.9448 3.4247 7.0689 6.6385 13.7985 41.1266 2.2566 22.6164 2.7408 93.4132 6.8151 19.3770 0.6953 12.3429 23.8757 13.6045 38.6267 7.2877 11.6970 7.1044 8.8241 40.4857 52.1349 83.1818 46.7430 77.0877 111.5153 85.0441 31.0487 116.1812 24.7656 28.5355 18.7494 26.7638 30.9347 38.8529 5.8288 22.1968 30.3295 53.6314 41.7938 55.4360 29.9224 46.2529 2.9140 10.7304 10.9205 9.7522 12.3452
temp: 298.150 k
press: 1.00000 atm
elementType: 17 8 8 8 7 7 6 6 6 6 6 6 6 6 6 6 6 6 6 6 6 6 6 1 1 1 1 1 1 1 1 1 1 1 1 1 1 1 1 1 1 1 1 1 1 1 1 1 1 1
symmnumber: 1
zpe: 1104044.4 jmol-1
zpe.correction: 0.420508 hartree
zpe.thermalcorrener: 0.444840 hartree
zpe.thermalcorrenthalpy: 0.445784 hartree
zpe.thermalcorrgfe: 0.362423 hartree
zpe.sumelectzpe: -1457.363910 hartree
zpe.sumelectthermal: -1457.339579 hartree
zpe.sumelectthermalent: -1457.338635 hartree
zpe.sumelectthermalfe: -1457.421995 hartree
dipole: -0.7572 1.1069 3.4477
dipole: 3.6994
quadrupole: -159.5049 -141.4883 -140.9090
quadrupole: 12.2300 -9.6803 -1.9098
quadrupole: -12.2042 5.8124 6.3918 12.2300 -9.6803 -1.9098
hfenergy: -1457.7844187 hartree
pointgroup: C01 [X(C17H27Cl1N2O3)]
dipole: 0.5740681 0.109797 -1.3329264 debye
polarizability: 194.775674|2.9112451|246.710193|-21.7884914|0.3402227|197.2099439 unknown
InChI: InChI=1S/C17H27ClN2O3/c1-2-19(7-8-20-9-11-22-12-10-20)13-15(21)14-23-17-6-4-3-5-16(17)18/h3-6,15,21H,2,7-14H2,1H3
charge 0 multiplicity 1
50 atoms
Cl 0.532997 -1.601141 2.852593
O  -4.603103 -2.050214 0.078215
O  2.643202 2.623794 2.038352
O  1.952517 0.13589 0.933868
N  -2.650584 -0.033653 -0.691295
N  -0.059914 2.769869 -0.631032
C  -1.320139 0.606935 -0.840387
C  -1.408134 2.143584 -0.698521
C  -3.031881 -0.239419 0.732008
C  -2.769011 -1.317364 -1.430863
C  0.540044 2.700295 0.725639
C  -4.466732 -0.783529 0.818401
C  -4.209542 -1.845567 -1.326055
C  -0.015201 4.142542 -1.207648
C  2.077479 2.510229 0.685763
C  2.4894 1.184705 0.036833
C  -0.033853 4.148449 -2.747541
C  2.142591 -1.201602 0.5975
C  1.526634 -2.168131 1.435399
C  2.900378 -1.652864 -0.512579
C  1.659635 -3.54419 1.191493
C  3.037934 -3.036632 -0.762214
C  2.423435 -3.985041 0.083894
H  -0.582574 0.198635 -0.108148
H  -0.927279 0.378071 -1.848463
H  -2.025849 2.410036 0.192757
H  -1.946636 2.53788 -1.577262
H  -2.975779 0.724063 1.271935
H  -2.334113 -0.954565 1.236343
H  -2.518777 -1.144092 -2.494928
H  -2.066695 -2.092233 -1.031306
H  0.105317 1.843119 1.271149
H  0.331453 3.613253 1.3295
H  -5.174573 -0.032246 0.405754
H  -4.74081 -1.021544 1.859624
H  -4.30914 -2.83309 -1.806786
H  -4.903153 -1.122051 -1.807129
H  -0.852284 4.772866 -0.816065
H  0.919796 4.622954 -0.862449
H  2.547096 3.33402 0.118658
H  3.591975 1.10047 -0.010357
H  2.03528 1.095001 -0.968266
H  0.009505 5.184952 -3.130879
H  -0.951991 3.681843 -3.147369
H  0.831403 3.58827 -3.143783
H  2.390632 1.800516 2.533343
H  3.380566 -0.928617 -1.176532
H  1.169692 -4.260541 1.85754
H  3.628481 -3.369432 -1.622348
H  2.529503 -5.056885 -0.109058
