program: Gaussian 09
title: 000211263
version: EM64L-G09RevD.01
frameworkgroup: C1[X(C7H10N4O3)]
method: RPBEPBE
basis: SDD
operation: Freq
keyword: #p
keyword: freq=noraman
keyword: PBEPBE/SDD
title: #p freq=noraman PBEPBE/SDD
converged: NO YES NO NO
title: Mulliken charges:
elementType: O O O N N N N C C C C C C C H H H H H H H H H H
charge: -0.256384 -0.154790 -0.286127 -0.201665 -0.008166 0.084204 -0.595158 0.470889 -0.517784 -0.524168 0.128069 -0.430447 -0.657115 0.232998 0.280274 0.234837 0.249255 0.288407 0.277533 0.228066 0.236626 0.212112 0.372494 0.336042
chargesum: 0.00000
title: Mulliken charges with hydrogens summed into heavy atoms:
elementType: O O O N N N N C C C C C C C
charge: -0.256384 -0.154790 -0.286127 -0.201665 -0.008166 0.084204 0.113378 0.470889 -0.002674 0.013493 0.128069 -0.152914 0.019688 0.232998
polarizability: 1.66732095e+02 1.62904995e+00 1.26926992e+02 6.11971588e+00 9.58078690e+00 7.44121825e+01
1716.lowfreq: -12.1405 -7.1473 -0.0012 -0.0010 -0.0007 5.5130 36.0828 71.5073 73.4970
frequency: 35.9866 71.5039 73.4639 80.2419 104.3863 152.8940 183.6186 200.9729 219.6779 271.5690 280.3288 359.2407 374.7283 429.7988 441.7531 500.0083 536.1549 578.0955 622.6132 651.1757 673.5449 691.1785 698.2805 750.1716 757.7264 781.2721 800.4952 849.1622 855.4298 897.3847 956.1757 997.8192 1049.7914 1059.1987 1104.2098 1132.7419 1146.8997 1197.6838 1227.7661 1259.3676 1292.1454 1319.6546 1326.9697 1344.7561 1354.9557 1359.3148 1373.3839 1393.2234 1411.3767 1459.2800 1474.2177 1479.7197 1493.4945 1511.6419 1591.1273 1654.6216 2986.9730 3006.3671 3058.3053 3069.2714 3085.5290 3096.1252 3138.5856 3231.3030 3407.6739 3621.1097
redmass: 8.2587 5.2628 3.1312 5.6178 4.9926 5.0981 1.5905 3.3817 3.6158 3.0093 6.0715 4.5974 4.7454 5.9684 1.9526 3.1232 4.4933 2.6468 9.8902 2.5411 2.4553 7.4285 3.6730 1.6414 2.4626 1.8982 1.9822 1.6513 3.2074 3.3459 2.1988 2.6024 1.6549 1.7277 1.9745 5.3137 2.6373 2.2835 1.7160 1.6745 2.5571 1.4551 1.4659 3.4687 6.2653 3.2086 5.8845 1.2766 3.0926 1.1584 1.0462 1.0971 1.1220 4.1023 1.2694 5.3272 1.0357 1.0614 1.1009 1.0586 1.1003 1.1011 1.1065 1.0988 1.0544 1.0972
irintensity: 4.0719 0.1749 1.4432 6.3633 6.1161 7.7683 1.5221 2.1625 6.2530 6.3635 0.3557 2.5334 0.3431 0.4478 7.2846 4.5567 4.0187 23.6468 9.9850 36.8659 83.6469 2.0534 13.7197 104.5137 96.0825 7.6921 0.1868 17.3246 9.7725 20.6812 0.3316 0.6743 4.5706 41.4831 9.7440 184.6167 20.4431 4.0477 41.8634 7.8542 43.7816 20.8750 9.8523 142.9251 210.8720 116.8946 64.1275 10.5437 14.6121 31.3207 14.8132 6.7331 8.6238 41.0824 100.3076 281.2910 27.7918 10.5397 2.4955 8.9161 39.2753 25.1811 0.9643 2.8571 100.3001 84.9700
temp: 298.150 k
press: 1.00000 atm
elementType: 8 8 8 7 7 7 7 6 6 6 6 6 6 6 1 1 1 1 1 1 1 1 1 1
symmnumber: 1
zpe: 476087.6 jmol-1
zpe.correction: 0.181332 hartree
zpe.thermalcorrener: 0.194690 hartree
zpe.thermalcorrenthalpy: 0.195635 hartree
zpe.thermalcorrgfe: 0.140458 hartree
zpe.sumelectzpe: -716.291874 hartree
zpe.sumelectthermal: -716.278516 hartree
zpe.sumelectthermalent: -716.277572 hartree
zpe.sumelectthermalfe: -716.332748 hartree
dipole: -3.9024 0.5789 0.6361
dipole: 3.9960
quadrupole: -93.0252 -85.9429 -79.0500
quadrupole: 18.4583 -3.5902 -1.0590
quadrupole: -7.0192 0.0632 6.9560 18.4583 -3.5902 -1.0590
hfenergy: -716.4732063 hartree
pointgroup: C01 [X(C7H10N4O3)]
dipole: 1.5583918 0.0484615 -0.2018324 debye
dipolederiv: -0.963674 -0.0956832 0.0050235 -0.181456 -0.6217447 -0.1063385 -0.2088732 -0.1787733 -0.3925968 -1.0638161 -0.1747257 -0.0892385 -0.2990811 -0.4309221 0.0177222 -0.0104729 0.0576595 -0.1935193 -0.5007265 -0.0097323 -0.0252158 0.2029307 -1.0062668 0.233705 -0.1741682 0.2132061 -0.3726087 0.2010135 -0.143258 0.1076447 -0.0619554 -0.414467 0.1833938 0.1325446 0.1287239 -0.2134507 0.082958 -0.1681707 0.1301889 -0.4961291 -0.24484 -0.0440286 0.2858957 0.0533581 -0.1691392 1.9543832 -0.095658 0.312568 -0.2139357 1.1925581 -0.3302798 0.3948731 -0.4170806 0.3483195 -0.8273246 0.1939424 0.1065265 0.2929808 -0.7298852 0.1018678 0.1680758 0.0007548 -0.5132245 0.448868 -0.185433 0.0439032 0.5403401 0.0270456 -0.001819 -0.3626924 -0.0168476 -0.0231151 -0.0686705 0.0389061 0.0107069 0.0447196 0.0305346 -0.019868 0.1903289 -0.0725018 0.0679723 0.1401655 -0.0087696 -0.0444034 -0.0514101 0.0781227 -0.1614124 -0.1023996 -0.2237293 0.182293 -0.6929583 0.4542257 -0.2908982 0.6904763 0.0547815 0.042362 -0.4617705 0.049175 0.0413401 -0.615221 0.1714704 -0.1228231 -0.3434432 0.1651702 -0.2057833 0.1674237 -0.1926524 -0.0286707 -0.0147407 0.0225524 0.0230052 -0.0804174 0.0927771 -0.0251321 -0.1037024 0.0059652 0.0322939 1.3640613 -0.1690209 -0.0337188 -0.0562257 0.8636653 0.3489242 0.1357144 0.5266467 0.3131627 0.0435425 0.0026389 0.0165879 -0.0694808 -0.0082511 -0.0352275 0.018895 -0.0037016 0.0803548 0.0312346 0.0220564 -0.0178204 0.0435796 0.0662864 0.0914102 -0.0494803 0.0604382 -0.0630624 -0.0233817 -0.0260284 0.0961236 0.000109 0.0347903 -0.0248996 0.0279517 -0.0116633 0.076121 0.0534517 0.027773 -0.119014 -0.0125777 0.0475845 0.003644 -0.0190605 -0.0080145 0.0718095 0.0772235 0.0338989 -0.0323655 0.0498829 0.0633478 0.0691747 -0.0315223 0.0687674 0.1286445 0.1007768 -0.0746932 0.0094047 -0.0106053 -0.1321812 -0.043511 0.0076366 0.008807 0.0682501 -0.2088366 0.0077965 0.0206561 -0.0136775 0.0911356 -0.0165507 0.0428296 -0.029427 0.0796333 0.0655527 0.0509874 -0.0879148 0.0347807 0.0288126 0.1018395 -0.0440657 0.063594 -0.0869116 0.2342656 0.1446107 -0.0051809 0.0125973 0.4927765 -0.0776494 0.0294666 0.0193848 0.281184 0.1818531 -0.0196859 -0.0137458 -0.0220021 0.2591692 -0.1015433 -0.0334279 -0.1020891 0.2849203 unknown
polarizability: 165.4765609|-5.1023682|126.4523683|8.3448753|-13.2160165|76.1423397 unknown
InChI: InChI=1S/C7H10N4O3/c1-2-5-3-9-7(11(13)14)10(5)4-6(8)12/h3H,2,4,8H2,1H3
charge 0 multiplicity 1
24 atoms
O  2.047461 2.696148 0.275596
O  -3.2859 -0.710863 -0.449669
O  -2.167989 1.212617 -0.978728
N  0.308732 -0.075778 -0.332681
N  -0.911078 -1.763746 0.621847
N  -2.206009 -0.024323 -0.52313
N  -0.269768 3.000194 0.235406
C  1.221401 -0.941707 0.280804
C  2.713936 -0.761807 0.245029
C  0.697097 1.14798 -1.07076
C  -0.970415 -0.615926 -0.088828
C  0.434746 -1.966695 0.857633
C  3.371245 -1.384681 -1.019999
C  0.890677 2.361272 -0.119035
H  2.974115 0.310265 0.319094
H  3.131196 -1.251391 1.143307
H  1.665787 0.966364 -1.558103
H  -0.068764 1.358507 -1.830319
H  0.782631 -2.822853 1.431315
H  3.155708 -2.465296 -1.088563
H  4.466311 -1.249802 -0.980942
H  3.005612 -0.908418 -1.948072
H  -1.173581 2.648443 -0.103938
H  -0.221252 3.795495 0.872438
