program: Gaussian 09
title: 000211260
version: EM64L-G09RevD.01
frameworkgroup: C1[X(C7H12O2)]
method: RPBEPBE
basis: SDD
operation: Freq
keyword: #pfreq=noraman
keyword: PBEPBE/SDD
title: #p freq=noraman PBEPBE/SDD
converged: YES YES NO NO
title: Mulliken charges:
elementType: O O C C C C C C C H H H H H H H H H H H H
charge: -0.214662 -0.223056 0.323823 -0.446089 -0.547784 -0.725800 -0.733199 -0.333316 0.195193 0.219517 0.219025 0.244642 0.250804 0.215484 0.212662 0.218670 0.235198 0.214074 0.220532 0.228835 0.225447
chargesum: 0.00000
title: Mulliken charges with hydrogens summed into heavy atoms:
elementType: O O C C C C C C C
charge: -0.214662 -0.223056 0.323823 -0.007548 -0.052338 -0.078984 -0.063395 0.120966 0.195193
polarizability: 8.47083882e+01 -4.55373477e+00 8.35024655e+01 1.46722709e+00 6.03776845e-02 6.63006511e+01
1716.lowfreq: -26.5663 -0.0010 -0.0006 -0.0005 7.0238 15.0656 79.4016 108.8634 197.5830
frequency: 79.3821 108.8383 197.5769 235.4821 256.1791 272.7569 310.5254 349.8188 387.5961 437.0524 460.1866 485.8648 540.5513 622.1688 726.8039 749.3651 863.2331 870.5449 931.7958 933.1660 940.6637 974.1640 1001.7358 1036.5241 1059.5119 1114.5873 1148.6347 1173.5026 1193.5851 1227.2085 1268.6054 1285.5599 1308.8654 1347.5111 1370.7865 1381.7172 1400.2700 1432.5908 1451.5982 1464.7148 1473.1236 1478.6437 1483.5354 1494.5994 1656.2476 2968.9586 2973.9384 2978.0666 2983.8876 3013.3466 3043.3716 3060.2318 3065.6787 3067.8743 3071.3558 3073.7553 3087.2189
redmass: 3.4880 5.0281 1.2425 1.1802 2.3878 1.3072 2.5096 2.9157 2.0105 3.7368 3.5032 3.8190 3.4323 3.6694 2.6080 3.7357 2.0397 2.6249 1.7735 2.2458 1.4811 1.6882 1.5716 1.6520 2.7027 2.7693 1.8986 1.7370 1.4096 1.5599 2.0016 1.7233 1.7651 1.5280 1.3231 1.2026 1.2078 1.0789 1.0837 1.0508 1.0614 1.0740 1.0585 1.0671 11.9024 1.0355 1.0388 1.0627 1.0595 1.0661 1.0974 1.0963 1.0993 1.0998 1.0988 1.0987 1.1049
irintensity: 4.3645 3.2461 1.1108 0.8231 0.5419 1.1464 0.7648 1.4965 0.2973 0.4946 1.9952 3.0222 4.0024 1.1280 9.4158 20.3077 1.2911 13.9487 3.9891 14.8746 2.2862 18.6826 6.4404 18.5115 22.9577 125.8562 32.8539 14.2131 31.7643 61.9053 3.1240 2.8996 8.1782 13.0005 3.2936 20.9050 13.5933 8.8065 4.5559 1.8178 11.4452 18.2844 11.3521 9.1356 290.0453 29.7501 27.5706 12.6668 19.6433 28.1233 35.0297 0.9553 25.6481 5.7139 55.6012 67.5986 28.4631
temp: 298.150 k
press: 1.00000 atm
elementType: 8 8 6 6 6 6 6 6 6 1 1 1 1 1 1 1 1 1 1 1 1
symmnumber: 1
zpe: 468787.0 jmol-1
zpe.correction: 0.178552 hartree
zpe.thermalcorrener: 0.187886 hartree
zpe.thermalcorrenthalpy: 0.188830 hartree
zpe.thermalcorrgfe: 0.144794 hartree
zpe.sumelectzpe: -423.671486 hartree
zpe.sumelectthermal: -423.662152 hartree
zpe.sumelectthermalent: -423.661208 hartree
zpe.sumelectthermalfe: -423.705243 hartree
dipole: -5.3564 1.7698 -0.4697
dipole: 5.6607
quadrupole: -69.0595 -53.0880 -53.0721
quadrupole: 3.6401 -0.8267 0.2663
quadrupole: -10.6529 5.3185 5.3344 3.6401 -0.8267 0.2663
hfenergy: -423.8500373 hartree
pointgroup: C01 [X(C7H12O2)]
dipole: 2.1354292 0.6174062 0.137013 debye
dipolederiv: -0.5095386 -0.0025809 -0.0389925 -0.4278568 -1.3055335 0.0965498 -0.0277416 0.0647051 -0.3135114 -0.9957626 -0.3864581 -0.0277248 -0.2786768 -0.7933491 0.0195123 -0.071596 -0.0072427 -0.3490952 0.128789 -0.0120385 -0.0213792 0.0108826 0.0760109 0.0239167 -0.0380781 0.0078786 0.1210879 -0.089031 0.0313886 -0.0399778 0.0535725 -0.0504213 0.0037183 -0.0331251 0.0230018 0.0729036 -0.234689 0.0976766 -0.0694276 0.1181867 -0.0718476 0.0534936 -0.1351037 0.0613057 0.0694977 -0.031187 0.0397564 -0.0366105 0.0445176 0.0478994 0.0165036 -0.0298125 0.0168611 0.0324324 0.0326382 0.0168522 -0.0081482 0.001802 0.0329624 -0.0137502 0.0065127 -0.003872 -0.0830347 0.4826111 0.2771063 -0.0532193 0.1712851 0.4686264 -0.032354 0.0022144 -0.0113445 0.3392966 1.1735249 0.1707023 0.1298687 0.4615003 1.7031254 -0.1088729 0.1676258 -0.093452 0.2397166 -0.085701 -0.145021 0.0262853 -0.084379 -0.0057712 0.0209894 0.0408465 0.0445379 0.0779947 0.0662531 0.0242316 0.0222942 0.0370578 0.0573852 0.0259035 -0.0019556 -0.022486 -0.1723342 0.0445328 0.0090111 -0.0005137 -0.0052277 0.0955114 -0.0045807 0.0249929 0.0365163 -0.1037246 0.0515841 0.0055595 -0.0006318 -0.0093353 -0.068478 -0.0590634 0.0134029 -0.0933274 0.0787473 -0.1102213 -0.0668818 0.0319771 -0.1341504 0.0201598 0.0421105 0.070349 0.05016 0.0667085 0.0721926 0.0105068 0.0451739 0.0065757 0.0875701 -0.0276826 -0.0133719 -0.0009438 -0.1791192 0.068195 0.0082957 -0.0123427 0.0744043 -0.1499683 -0.0425045 0.0052282 -0.078155 0.0710362 -0.0875326 0.0536724 -0.1110751 0.0554149 0.0693918 0.0526372 -0.0877091 0.032712 0.0187664 -0.0523939 -0.1093554 0.0777539 -0.133161 -0.0014937 0.0654883 0.0387981 0.0205613 0.0447293 0.0769592 0.0463839 0.0317184 0.0709136 -0.1271614 -0.0980093 0.014746 -0.0346631 0.056941 0.000981 0.0355395 0.0327624 0.0239139 -0.1253447 -0.0498444 0.0308892 -0.1090775 0.0496031 -0.0022037 -0.1043473 0.0222093 -0.0572401 0.0407262 0.015839 0.0228875 0.0963241 -0.1386422 unknown
polarizability: 85.0991114|4.5644|83.0408993|1.0968924|-1.1908252|66.3714941 unknown
InChI: InChI=1S/C7H12O2/c1-7(2)3-4-9-6(8)5-7/h3-5H2,1-2H3
charge 0 multiplicity 1
21 atoms
O  -1.554755 0.938901 -0.022507
O  -2.485073 -1.136557 0.016718
C  1.162233 -0.228164 -0.000557
C  0.912695 1.222441 0.496265
C  -0.075506 -1.062684 0.427397
C  2.431379 -0.802556 0.67353
C  1.329733 -0.276662 -1.54279
C  -0.35404 1.825681 -0.11712
C  -1.443925 -0.455803 0.103864
H  1.769863 1.873778 0.235914
H  0.830601 1.215629 1.601326
H  -0.05841 -1.21235 1.526819
H  -0.05989 -2.070779 -0.023522
H  3.33329 -0.24738 0.354354
H  2.364454 -0.738661 1.776183
H  2.576359 -1.865433 0.403643
H  0.407163 0.017552 -2.075766
H  2.145077 0.393796 -1.873094
H  1.582913 -1.302373 -1.868747
H  -0.660043 2.751756 0.396669
H  -0.218717 2.046968 -1.19148
