program: Gaussian 09
title: 000216593
version: EM64L-G09RevD.01
frameworkgroup: C1[X(C20H24N2O4)]
method: RPBEPBE
basis: SDD
operation: Freq
keyword: #p
keyword: freq=noraman
keyword: PBEPBE/SDD
title: #p freq=noraman PBEPBE/SDD
converged: YES YES NO NO
title: Mulliken charges:
elementType: O O O O N N C C C C C C C C C C C C C C C C C C C C H H H H H H H H H H H H H H H H H H H H H H H H
charge: -0.267941 -0.289962 -0.301625 -0.308990 -0.079623 -0.486188 -0.529366 -0.396591 0.335033 -0.484468 0.276448 -0.668188 -0.379356 -0.622926 0.517060 -0.388433 0.113658 0.364739 -0.554603 -0.506182 0.233252 0.291227 0.046384 -0.524322 -0.526820 -0.524694 0.235269 0.207349 0.215759 0.190590 0.188907 0.234838 0.221889 0.231270 0.224327 0.186699 0.228203 0.310686 0.316356 0.298473 0.231673 0.264476 0.231105 0.213634 0.225424 0.232784 0.249276 0.234705 0.228572 0.260214
chargesum: 0.00000
title: Mulliken charges with hydrogens summed into heavy atoms:
elementType: O O O O N N C C C C C C C C C C C C C C C C C C C C
charge: -0.267941 -0.289962 -0.301625 -0.308990 -0.079623 -0.169832 -0.086748 0.009759 0.335033 -0.060723 0.276448 -0.446300 -0.148086 0.016304 0.517060 -0.077748 0.113658 0.364739 -0.256130 -0.274509 0.233252 0.291227 0.046384 0.184894 0.180663 0.198797
polarizability: 4.33955495e+02 1.99913020e+00 2.50915846e+02 -1.88613384e+00 4.20892714e+00 1.40190303e+02
1716.lowfreq: -7.8743 -1.5589 -0.0008 -0.0004 0.0009 2.4150 12.8817 23.0559 37.9111
frequency: 12.2676 22.8968 37.8990 51.0520 63.0193 68.8643 80.1659 86.3493 96.7100 116.1958 124.6097 140.2787 149.7381 152.2787 156.6400 168.5135 184.2305 206.0263 211.1324 228.8448 236.5045 250.1645 265.5480 286.1147 313.2851 319.7512 325.7239 343.2050 365.9611 371.7857 413.9922 417.8099 429.7027 436.0212 481.5091 504.3065 521.2013 550.1981 572.1969 579.9609 609.0378 611.0156 644.3906 652.0943 675.9359 712.8129 731.0121 738.9447 761.7263 772.9040 797.5398 813.8108 847.7279 860.7790 871.2517 875.7630 892.1866 917.6006 926.9634 936.7205 939.1353 976.6107 987.4705 996.3438 997.9526 1036.5232 1046.9767 1067.7910 1077.7553 1107.8903 1111.2423 1112.7143 1113.2515 1116.5970 1144.8918 1151.0335 1151.8009 1158.3275 1162.4974 1178.4428 1183.6028 1194.9437 1201.1800 1223.7814 1232.9764 1247.2343 1267.2096 1286.7365 1296.9150 1299.2818 1334.6935 1340.2931 1359.1631 1369.1245 1381.6657 1391.4272 1410.7000 1418.4346 1431.5773 1434.2749 1435.9595 1442.6653 1453.5873 1457.7132 1459.3365 1459.4016 1463.4917 1465.2084 1476.5212 1479.9798 1482.4405 1484.0403 1486.3957 1506.0633 1518.8710 1558.7517 1594.2443 1602.2555 1605.2067 1627.2286 2790.3118 2836.6577 2855.4663 2973.7424 2975.9144 2978.3484 2982.3595 2998.8520 3017.4577 3031.7459 3036.7716 3071.0359 3076.9459 3084.1890 3084.9532 3091.2357 3118.6456 3123.3968 3125.8470 3129.9162 3141.6178 3176.9931 3199.3763 3536.4220
redmass: 4.4715 3.9074 4.7306 4.2697 3.7668 2.4099 3.3619 3.6165 2.7410 2.0435 2.4791 2.8192 1.8210 1.4273 1.4885 2.4156 3.3707 3.0367 2.9813 1.6691 2.4244 4.4239 2.9800 4.9326 3.8790 4.2573 2.1712 3.9335 4.4384 6.3851 5.3073 4.2276 3.8599 3.4755 3.6372 5.7301 6.2908 3.5851 4.1121 4.8152 4.8740 3.0692 1.8687 2.8484 5.4884 2.8745 5.2578 4.3889 2.7629 4.5302 3.6752 5.6793 1.3181 2.4073 2.6770 1.9776 4.3473 2.9720 1.8495 2.6882 7.6512 1.4652 2.8216 1.7218 3.0863 6.4046 1.8440 1.9204 2.1200 2.4141 1.2413 1.2381 1.2434 1.4192 1.7104 1.5580 1.4174 1.4804 2.2812 1.6490 1.4662 1.4192 1.6355 1.8447 1.7428 1.6103 1.8894 1.9049 2.0583 3.4225 1.7083 1.7083 6.6867 1.9494 2.2034 3.0749 2.9494 1.4298 1.1813 1.2601 1.4119 1.1078 1.3192 1.0612 1.0799 1.1596 1.5497 1.0652 1.0586 1.1119 1.0624 1.0542 1.0555 2.9414 2.3434 7.2705 8.8836 6.7363 4.1211 6.6686 1.0712 1.0685 1.0594 1.0309 1.0344 1.0598 1.0295 1.0848 1.0721 1.0955 1.0938 1.1042 1.1008 1.1026 1.1003 1.0908 1.0907 1.1026 1.1037 1.1046 1.0907 1.0920 1.0943 1.0756
irintensity: 0.8255 0.3521 0.9960 1.8329 0.9040 1.6468 1.4803 7.5818 7.8411 1.1729 1.0705 0.5654 7.7456 1.7546 1.0301 1.6563 0.3025 5.1579 6.3163 3.2449 13.5698 7.6655 3.3633 20.7912 0.7353 4.1068 4.6086 0.3703 2.2792 3.3225 9.6408 1.8112 6.4972 0.8455 3.6141 4.6636 0.3057 5.0126 12.5379 7.9267 1.9116 21.6166 15.7277 17.0119 18.7597 3.8505 3.5094 26.5740 20.1835 9.7117 1.8442 7.8697 30.6629 10.9818 3.5841 37.0431 39.5909 13.4292 28.6671 18.1864 72.4125 7.6412 35.8905 7.8498 52.9098 175.6455 8.9870 7.0112 18.4454 38.6472 12.6355 9.3918 1.2418 24.6894 10.3908 8.1267 8.5210 16.3415 31.5074 29.0036 10.6515 2.8248 16.4272 8.0096 14.8666 6.3667 6.9587 44.1156 225.4717 135.5680 38.6892 35.0391 15.8926 39.2374 231.9010 65.0383 48.0326 9.7532 13.9364 28.6189 23.0835 9.6314 55.3770 19.5488 38.4106 11.1130 44.3124 7.6845 3.7767 32.7874 11.7859 19.1966 41.1189 293.9180 175.5541 191.0749 56.7497 24.1719 10.4921 50.7697 73.6496 57.9339 239.2724 62.5492 98.1472 26.3819 67.1855 27.5646 55.1164 34.8154 50.3950 26.5690 33.3034 17.9761 34.1407 21.4050 18.7152 23.9056 23.8307 13.3496 7.5508 4.4247 6.9491 8.2091
temp: 298.150 k
press: 1.00000 atm
elementType: 8 8 8 8 7 7 6 6 6 6 6 6 6 6 6 6 6 6 6 6 6 6 6 6 6 6 1 1 1 1 1 1 1 1 1 1 1 1 1 1 1 1 1 1 1 1 1 1 1 1
symmnumber: 1
zpe: 1061272.5 jmol-1
zpe.correction: 0.404217 hartree
zpe.thermalcorrener: 0.430360 hartree
zpe.thermalcorrenthalpy: 0.431305 hartree
zpe.thermalcorrgfe: 0.346140 hartree
zpe.sumelectzpe: -1184.954046 hartree
zpe.sumelectthermal: -1184.927903 hartree
zpe.sumelectthermalent: -1184.926958 hartree
zpe.sumelectthermalfe: -1185.012123 hartree
dipole: -1.6282 3.5966 2.6668
dipole: 4.7643
quadrupole: -106.3492 -152.8629 -154.5657
quadrupole: -3.5965 0.0849 1.7858
quadrupole: 31.5767 -14.9370 -16.6397 -3.5965 0.0849 1.7858
hfenergy: -1185.358263 hartree
pointgroup: C01 [X(C20H24N2O4)]
dipole: 0.6036207 -1.365454 1.1334285 debye
polarizability: 433.9185812|-1.520525|250.0648711|4.0197919|-10.5408742|141.0781921 unknown
InChI: InChI=1S/C20H24N2O4/c1-22-8-7-13-9-16(6-5-14(13)12-22)21-20(23)15-10-17(24-2)19(26-4)18(11-15)25-3/h5-6,9-11,21H,7-8,12H2,1-4H3
charge 0 multiplicity 1
50 atoms
O  0.330587 2.274337 -0.431411
O  3.674698 -2.798691 -0.245365
O  5.318644 1.847422 0.292196
O  5.900317 -0.975815 0.07166
N  -7.049825 -0.357544 -0.197067
N  -0.547615 0.147568 0.032885
C  -5.126092 -1.752136 0.464503
C  -6.552078 -1.300309 0.830236
C  -4.218001 -0.563033 0.18198
C  -6.287188 0.909555 -0.188419
C  -4.779415 0.69697 -0.156548
C  -2.813564 -0.700673 0.236435
C  -3.909977 1.779442 -0.430509
C  -8.501548 -0.120645 -0.117283
C  -1.949562 0.388839 -0.043499
C  -2.508857 1.650403 -0.381948
C  0.502093 1.039976 -0.180819
C  1.887729 0.449288 -0.075975
C  2.95763 1.36174 0.087705
C  2.164424 -0.939527 -0.139396
C  3.492382 -1.416538 -0.065202
C  4.280569 0.895792 0.17694
C  4.571325 -0.49619 0.064479
C  4.514119 -3.507551 0.747298
C  6.130884 1.744473 1.527578
C  6.695068 -0.564626 -1.11605
H  -5.186731 -2.388864 -0.439818
H  -4.704624 -2.374772 1.277581
H  -7.228642 -2.174196 0.858002
H  -6.557158 -0.840934 1.853711
H  -6.573037 1.545282 0.695462
H  -6.562618 1.488913 -1.091149
H  -2.385919 -1.678934 0.499814
H  -4.338082 2.755552 -0.691932
H  -8.819072 0.527323 -0.954498
H  -8.819993 0.37277 0.837165
H  -9.041767 -1.079973 -0.204541
H  -1.84827 2.492099 -0.593109
H  -0.289349 -0.802805 0.305124
H  2.749663 2.433952 0.137028
H  1.390813 -1.696594 -0.309363
H  5.531995 -3.086438 0.774014
H  4.531206 -4.554058 0.407369
H  4.048859 -3.445673 1.750146
H  5.497045 1.938229 2.413353
H  6.896771 2.529446 1.43718
H  6.603183 0.749176 1.610526
H  6.249184 -0.994205 -2.031392
H  7.700825 -0.980199 -0.952162
H  6.735372 0.536276 -1.189413
