program: Gaussian 09
title: 000216558
version: EM64L-G09RevD.01
frameworkgroup: C1[X(C11H14ClN2O3PS2)]
method: RPBEPBE
basis: SDD
operation: Freq
keyword: #p
keyword: freq=noraman
keyword: PBEPBE/SDD
title: #p freq=noraman PBEPBE/SDD
converged: NO YES NO NO
title: Mulliken charges:
elementType: Cl S S P O O O N N C C C C C C C C C C C H H H H H H H H H H H H H H
charge: -0.033822 0.014977 -0.255722 0.488858 -0.476198 -0.235498 -0.176115 -0.166461 -0.002223 -0.610972 -0.683520 0.104016 0.267499 -0.627770 0.224616 -0.218765 -0.234575 -0.658166 -0.014522 -0.352911 0.277540 0.288464 0.314629 0.322915 0.232639 0.243009 0.238321 0.265100 0.229533 0.290111 0.215098 0.226092 0.229895 0.273926
chargesum: 0.00000
title: Mulliken charges with hydrogens summed into heavy atoms:
elementType: Cl S S P O O O N N C C C C C C C C C C C
charge: -0.033822 0.014977 -0.255722 0.488858 -0.476198 -0.235498 -0.176115 -0.166461 -0.002223 -0.044968 -0.045976 0.104016 0.267499 0.086199 0.224616 0.275868 0.055536 0.012919 -0.014522 -0.078984
polarizability: 3.29924008e+02 1.86308002e+01 1.99154196e+02 1.74390423e+01 3.99535574e+00 1.54757517e+02
1716.lowfreq: -36.9199 -2.2141 0.0016 0.0020 0.0023 5.6842 12.1287 19.8226 32.4675
frequency: -36.8661 18.6846 32.1856 37.3412 60.5085 68.4366 79.4888 89.7940 96.9065 107.2372 122.3580 150.4724 158.2855 171.6957 197.8284 215.5123 234.6201 243.1548 253.6508 271.3459 291.3927 303.2324 313.9874 344.5691 351.1429 354.2846 413.9690 427.1481 436.1320 508.1229 547.6073 574.5295 585.8756 632.2022 647.0430 664.9186 667.2772 690.1726 694.6279 710.9087 756.4206 774.7796 800.0534 831.4415 872.3195 875.2738 876.9517 889.8984 922.6808 1000.2372 1018.2093 1029.5443 1043.5148 1062.8873 1064.9860 1096.2638 1105.3412 1133.4057 1209.2086 1238.6577 1252.1011 1261.1156 1275.7264 1285.9952 1315.0616 1338.1317 1362.1814 1369.9085 1394.0979 1401.9375 1403.3844 1423.9383 1428.0756 1452.6586 1458.3587 1471.5033 1476.6815 1485.0590 1490.2061 1568.8709 1597.3119 1756.5919 2948.2430 2992.8901 2993.7288 3005.8158 3023.4005 3078.4921 3085.4948 3090.7745 3091.0973 3107.3944 3109.4190 3121.9048 3176.6709 3195.3990
redmass: 1.9240 8.4933 5.8133 7.7235 3.9407 4.3385 3.9012 7.1554 4.8490 6.8122 4.4720 2.7562 6.3033 5.5349 5.0180 2.3474 1.8243 2.0655 3.6809 2.9740 3.8267 5.2069 5.0464 7.3475 9.2590 8.8237 12.1510 5.2406 4.7786 9.1252 9.4377 5.6492 4.6632 8.9799 8.5054 8.8086 5.9669 8.8761 5.6296 8.6558 7.1931 1.2108 1.0995 4.0876 3.8583 4.1810 1.4582 1.3665 4.1137 1.6769 2.5353 3.6314 1.2951 2.3678 1.8804 5.5688 2.2425 1.4572 3.0340 1.2028 1.4729 1.1232 1.3228 1.6992 1.6228 2.5858 5.5189 1.2398 1.2535 1.2402 2.2729 1.0824 1.1447 4.0739 1.0405 1.0363 1.0520 1.0476 1.0794 9.6142 9.0987 12.3691 1.0710 1.0355 1.0355 1.0603 1.0585 1.1040 1.1022 1.0995 1.0980 1.1032 1.1034 1.0956 1.0932 1.0953
irintensity: 0.2781 0.4057 0.0550 0.9290 1.6152 0.9685 0.0655 0.4540 1.3975 2.6045 5.0102 2.3081 2.6321 0.7415 2.0020 1.3262 1.6605 1.3711 1.2409 1.7955 5.1016 18.0199 5.6370 25.7244 5.7007 37.9401 7.6278 11.3684 0.6784 71.5592 14.8543 28.1062 23.7614 55.6511 15.3902 9.9602 27.0061 10.5439 91.5135 52.2622 7.5404 39.4278 1.1599 153.2592 52.3961 130.3632 43.6791 0.2941 6.7246 13.3353 101.6152 2.7630 10.8089 7.3930 23.4973 3.9326 7.9027 14.3072 52.0323 4.9699 2.2792 0.7116 15.6908 110.5984 51.4834 21.6110 99.7996 3.3003 28.3038 20.7431 16.5939 6.6025 24.3639 489.2088 13.5652 21.5297 8.3392 9.7297 21.4939 25.1151 13.8380 582.3219 42.7891 26.4582 22.6351 14.5642 3.6756 1.3731 1.9633 12.1953 26.9084 10.1980 34.4973 11.7590 4.4560 1.6300
temp: 298.150 k
press: 1.00000 atm
elementType: 17 16 16 15 8 8 8 7 7 6 6 6 6 6 6 6 6 6 6 6 1 1 1 1 1 1 1 1 1 1 1 1 1 1
symmnumber: 1
zpe: 637970.6 jmol-1
zpe.correction: 0.242990 hartree
zpe.thermalcorrener: 0.264559 hartree
zpe.thermalcorrenthalpy: 0.265503 hartree
zpe.thermalcorrgfe: 0.189838 hartree
zpe.sumelectzpe: -2358.674091 hartree
zpe.sumelectthermal: -2358.652522 hartree
zpe.sumelectthermalent: -2358.651578 hartree
zpe.sumelectthermalfe: -2358.727243 hartree
dipole: -0.0470 -1.2957 -1.6472
dipole: 2.0963
quadrupole: -137.3136 -143.9756 -153.2563
quadrupole: -5.1086 -9.1882 -0.7686
quadrupole: 7.5349 0.8729 -8.4078 -5.1086 -9.1882 -0.7686
hfenergy: -2358.9170808 hartree
pointgroup: C01 [X(C11H14Cl1N2O3P1S2)]
dipole: -0.0733402 0.3934423 0.721118 debye
polarizability: 332.0995768|0.805322|194.9369343|-19.7454444|8.3343156|156.7992097 unknown
InChI: InChI=1S/C7H4ClN2O2S.C4H10OPS/c8-4-1-5-6(9-2-4)10(3-13)7(11)12-5;1-3-5-6(7)4-2/h1-2H,3H2;3-4H2,1-2H3
charge 0 multiplicity 1
34 atoms
Cl -6.30868 -0.39752 0.40893
S  1.436463 1.158904 1.009572
S  3.618602 1.346211 -1.972618
P  3.598539 1.017419 0.083358
O  4.292698 -0.46318 0.665224
O  -1.406742 -2.070054 -0.815945
O  0.92547 -1.785192 -1.194127
N  -0.520595 0.053025 -0.662545
N  -2.595116 1.244763 -0.051914
C  4.553862 2.205263 1.176419
C  0.423915 1.159731 -0.594972
C  -1.89657 0.142427 -0.364224
C  -2.427099 -1.168226 -0.471339
C  4.162912 3.67208 0.935634
C  -0.16881 -1.281979 -0.926994
C  4.049058 -1.735585 -0.086328
C  -3.784273 -1.398463 -0.245234
C  4.85625 -2.808334 0.636943
C  -4.529649 -0.236645 0.087931
C  -3.93313 1.0418 0.177777
H  4.358908 1.883658 2.214721
H  5.618004 2.017202 0.949276
H  -0.153283 2.09458 -0.62145
H  1.150048 1.11931 -1.432828
H  4.769514 4.324602 1.588398
H  4.344131 3.967926 -0.112544
H  3.097883 3.847284 1.167475
H  2.96687 -1.949246 -0.086407
H  4.38376 -1.592559 -1.131049
H  -4.239739 -2.38825 -0.316159
H  4.714754 -3.779242 0.127213
H  5.932592 -2.565061 0.632845
H  4.522196 -2.913266 1.683181
H  -4.527545 1.92152 0.437482
