program: Gaussian 09
title: 000216555
version: EM64L-G09RevD.01
frameworkgroup: C1[X(C15H19ClN2)]
method: RPBEPBE
basis: SDD
operation: Freq
keyword: #p
keyword: freq=noraman
keyword: PBEPBE/SDD
title: #p freq=noraman PBEPBE/SDD
converged: YES YES NO NO
title: Mulliken charges:
elementType: Cl N N C C C C C C C C C C C C C C C H H H H H H H H H H H H H H H H H H H
charge: -0.082942 -0.187446 -0.100027 -0.472870 -0.381141 -0.516944 0.183746 -0.274738 0.350223 0.375161 -0.777195 -0.807919 -0.302626 -0.360797 0.461088 -0.403463 -0.386834 -0.808616 0.240425 0.230416 0.245260 0.221074 0.271983 0.239990 0.270830 0.233869 0.214979 0.213686 0.222223 0.251757 0.223356 0.248996 0.252797 0.229356 0.223894 0.235730 0.222721
chargesum: 0.00000
title: Mulliken charges with hydrogens summed into heavy atoms:
elementType: Cl N N C C C C C C C C C C C C C C C
charge: -0.082942 -0.187446 -0.100027 -0.002029 0.085192 -0.004971 0.183746 -0.003908 0.350223 0.375161 -0.114661 -0.110582 -0.302626 -0.111801 0.461088 -0.150666 -0.157478 -0.126271
polarizability: 3.22160772e+02 -1.14331351e+00 1.59927743e+02 -1.11911537e+01 1.12944929e+01 1.40384984e+02
1716.lowfreq: -6.9692 -5.9931 -0.0003 0.0011 0.0017 6.2416 21.6972 28.8214 38.8262
frequency: 20.7512 28.6452 38.7822 44.5966 51.4046 90.2278 106.9362 132.9447 139.3488 155.1237 178.4228 184.6794 213.4797 216.7255 242.8620 291.0399 320.5695 331.6692 343.6378 364.7509 397.9397 432.2579 453.8772 468.2430 504.0684 537.3895 543.1457 578.7364 610.1287 648.3126 668.7413 716.7941 754.9748 796.2392 816.6732 826.3153 856.8617 868.6464 874.2496 885.1380 907.2194 944.5165 952.5920 957.4647 991.3267 1000.2572 1002.4054 1031.7990 1042.0585 1044.4576 1073.0670 1077.7194 1084.2910 1136.0973 1157.3802 1193.1427 1199.0470 1211.0125 1224.8929 1237.7463 1255.5564 1278.7531 1298.6956 1303.6122 1322.9557 1337.7164 1374.2992 1390.0790 1392.0297 1397.5380 1399.7713 1411.8002 1452.7437 1455.8294 1468.9524 1469.1866 1472.2007 1473.1462 1475.6462 1479.4474 1486.7106 1501.3067 1546.4409 1614.0959 1657.5717 1695.7567 2951.5968 2958.9245 2966.5398 2972.2335 2997.4946 3018.5628 3020.1003 3022.1981 3052.7824 3059.6713 3081.7211 3082.7873 3087.1913 3098.3100 3118.7527 3124.2520 3136.1269 3144.9707 3157.3355
redmass: 1.0742 4.5280 3.4552 3.3353 4.0617 1.8751 2.7504 1.9145 2.2509 3.8076 3.9444 1.3915 2.9480 2.2015 3.4064 4.3124 3.7141 3.9334 3.4251 3.1523 4.7290 3.2736 2.8204 3.5708 4.6916 3.3565 3.8178 4.4332 3.3368 3.1668 6.9752 3.9335 4.5861 3.4571 3.1849 1.4522 2.9914 1.3487 2.1850 1.4766 1.6811 2.4138 1.3437 1.3880 1.5574 1.8098 1.4901 2.4540 1.9541 1.5377 1.6325 1.7122 1.9761 1.3756 1.2479 1.7689 2.6675 1.7492 1.2522 3.3433 1.6977 1.8699 1.5543 2.6628 1.6447 3.8684 1.8522 1.2361 1.5597 1.2340 2.7007 1.5735 1.0959 1.0514 1.1484 1.0479 1.0593 1.0629 1.0877 1.5624 1.6153 1.1079 5.3305 7.0515 11.3497 6.4933 1.0380 1.0417 1.0662 1.0389 1.0674 1.0966 1.0957 1.0635 1.0947 1.0964 1.0974 1.0996 1.0981 1.1023 1.0922 1.0886 1.0894 1.0920 1.0956
irintensity: 1.0198 0.5546 0.6847 1.0241 1.6492 0.8365 0.8256 0.5490 0.5512 2.6481 1.1692 0.5719 2.0372 0.6472 0.3979 0.7494 0.3244 0.8581 1.0679 1.3309 1.4754 7.1460 7.8375 6.4063 3.8513 9.8455 6.2605 5.1097 0.3514 21.3884 9.1962 5.0956 0.7968 23.5571 8.0908 38.2391 10.5537 7.1922 1.5538 23.3183 3.4523 8.4796 1.4001 1.6532 9.9891 4.6325 10.0179 22.2135 1.8707 25.8706 1.4391 17.7560 51.4928 3.7271 6.7599 8.0011 90.1287 3.9804 28.7308 71.5444 10.3385 6.1453 81.3638 184.7118 55.3651 11.4798 146.3844 23.2071 25.3528 6.9136 3.4118 72.3982 7.2944 2.8156 21.7037 9.1622 28.4589 11.4054 6.3275 42.1565 18.9446 6.5315 3.5805 36.3920 1153.2393 72.8643 54.2775 98.7309 80.1147 53.3204 15.6796 1.5545 62.8316 21.6741 23.9372 27.7958 31.5833 19.3078 17.2753 26.4518 24.4039 20.6739 17.8986 8.6515 10.3518
temp: 298.150 k
press: 1.00000 atm
elementType: 17 7 7 6 6 6 6 6 6 6 6 6 6 6 6 6 6 6 1 1 1 1 1 1 1 1 1 1 1 1 1 1 1 1 1 1 1
symmnumber: 1
zpe: 799507.5 jmol-1
zpe.correction: 0.304516 hartree
zpe.thermalcorrener: 0.323522 hartree
zpe.thermalcorrenthalpy: 0.324466 hartree
zpe.thermalcorrgfe: 0.254782 hartree
zpe.sumelectzpe: -1151.212365 hartree
zpe.sumelectthermal: -1151.193359 hartree
zpe.sumelectthermalent: -1151.192415 hartree
zpe.sumelectthermalfe: -1151.262100 hartree
dipole: -1.5581 1.6911 -2.2074
dipole: 3.1875
quadrupole: -94.4692 -110.9821 -114.9040
quadrupole: -4.8203 -0.3278 -1.4937
quadrupole: 12.3159 -4.1970 -8.1189 -4.8203 -0.3278 -1.4937
hfenergy: -1151.5168813 hartree
pointgroup: C01 [X(C15H19Cl1N2)]
dipole: 0.5618664 1.0457381 0.404285 debye
polarizability: 322.2695568|3.8407562|144.7420044|-8.9468117|-14.3995891|155.4619384 unknown
InChI: InChI=1S/C15H19ClN2/c1-11(2)10-18-8-4-5-15(18)17-14-7-6-12(3)9-13(14)16/h6-7,9-10H,4-5,8H2,1-3H3
charge 0 multiplicity 1
37 atoms
Cl -1.402624 0.207407 -2.447548
N  2.146599 0.741914 -0.010814
N  0.01471 -0.227377 0.344174
C  1.578774 2.928941 -0.775612
C  2.762851 2.067252 -0.266619
C  0.338549 2.285296 -0.109231
C  0.749235 0.82442 0.08109
C  2.812123 -0.503137 0.065426
C  4.141139 -0.795054 0.207016
C  -1.392387 -0.225448 0.343965
C  4.560583 -2.257644 0.179465
C  5.295645 0.172128 0.411208
C  -2.201995 -0.093669 -0.820689
C  -2.094321 -0.491186 1.557324
C  -4.282261 -0.455946 0.422978
C  -3.604013 -0.205561 -0.795888
C  -3.497571 -0.593288 1.598189
C  -5.792939 -0.61158 0.455571
H  1.498079 2.842879 -1.873381
H  1.703692 3.993986 -0.520076
H  3.570015 1.973177 -1.01263
H  3.193977 2.487461 0.664506
H  -0.575135 2.370136 -0.716675
H  0.127564 2.731827 0.882259
H  2.088943 -1.323826 -0.000946
H  3.699332 -2.932367 0.035698
H  5.068357 -2.5440 1.122766
H  5.282962 -2.450179 -0.639995
H  5.895005 -0.145703 1.287872
H  4.987433 1.212818 0.5856
H  5.98613 0.157952 -0.45697
H  -1.494906 -0.619655 2.464517
H  -4.167747 -0.099813 -1.728913
H  -3.992785 -0.789849 2.556777
H  -6.278023 -0.044157 -0.358215
H  -6.090027 -1.672437 0.339511
H  -6.213264 -0.257717 1.413889
