program: Gaussian 09
title: 000211254
version: EM64L-G09RevD.01
frameworkgroup: C1[X(C11H16N2O5S)]
method: RPBEPBE
basis: SDD
operation: Freq
keyword: #p
keyword: freq=noraman
keyword: PBEPBE/SDD
title: #p freq=noraman PBEPBE/SDD
converged: YES YES NO NO
title: Mulliken charges:
elementType: S O O O O O N N C C C C C C C C C C C H H H H H H H H H H H H H H H H
charge: 1.068969 -0.297435 -0.281293 -0.589884 -0.515270 -0.545642 -0.119800 -0.682669 -0.560895 -0.421417 0.356521 0.151965 -0.501031 0.250976 -0.363152 0.188117 -0.359489 -0.535853 -0.511018 0.288273 0.290566 0.206866 0.259043 0.325011 0.198201 0.251251 0.330640 0.325482 0.371018 0.232125 0.258969 0.228685 0.261202 0.214788 0.226178
chargesum: 0.00000
title: Mulliken charges with hydrogens summed into heavy atoms:
elementType: S O O O O O N N C C C C C C C C C C C
charge: 1.068969 -0.297435 -0.281293 -0.218865 -0.515270 -0.545642 -0.119800 -0.026548 0.017944 0.044492 0.356521 0.151965 -0.176020 0.250976 -0.164951 0.188117 -0.108238 0.183926 0.191151
polarizability: 2.62900233e+02 -7.73038242e+00 2.10012902e+02 1.02721341e+01 3.86861169e+00 1.09439781e+02
1716.lowfreq: -5.5017 -0.0013 -0.0006 0.0011 5.4379 8.0097 16.9556 24.9432 29.6845
frequency: 16.3227 24.8606 29.6773 40.7135 51.8988 69.3422 96.8421 102.1124 117.4709 153.1480 166.5014 173.2638 181.9751 200.9099 211.9960 224.6863 259.3207 275.4121 282.3081 291.6993 299.6077 322.0181 338.2279 341.8619 379.4082 415.2339 432.3950 458.1344 471.6215 475.3449 503.4124 538.8073 542.4134 553.8824 585.2599 611.5818 695.3486 713.1454 728.6440 745.1391 805.7666 810.7289 834.7959 890.1512 924.6819 928.0881 934.2652 939.7458 960.2982 984.0161 1001.4381 1036.6295 1040.0990 1100.3968 1103.0934 1110.3905 1112.0169 1131.1847 1147.0552 1156.2358 1158.6402 1202.4247 1205.0719 1255.0056 1266.5542 1272.4563 1341.5632 1361.0525 1382.5817 1411.0900 1415.2642 1430.7381 1433.6613 1446.0087 1453.4101 1465.6175 1473.3785 1475.4363 1506.3515 1573.1762 1606.4817 1614.0838 1643.3986 2876.8712 2976.1288 2982.6268 2984.3435 3068.9026 3079.0696 3095.0583 3125.4567 3130.7802 3133.5091 3151.8914 3167.8739 3168.2400 3506.1286 3558.0914 3696.2089
redmass: 1.8873 4.5396 4.6809 8.6758 7.1342 3.2714 4.4492 3.4057 2.6753 2.9493 2.8547 4.8486 2.3329 3.5529 1.7676 3.3514 1.8864 2.2173 3.2340 5.8011 3.7893 3.6401 6.1465 4.2770 3.4194 4.2143 1.2953 1.2712 4.3770 4.3435 5.3688 12.0994 4.3881 4.5014 4.0766 4.1083 4.5668 3.5519 5.0372 3.9327 1.6458 2.0517 7.9574 4.0064 1.6375 2.5972 1.4250 2.7942 8.2476 5.1062 2.1615 2.1315 1.2447 1.7315 1.3012 1.3707 1.9987 1.4781 1.5382 1.4122 1.3737 1.3742 2.1597 3.0496 1.2578 1.4156 1.3772 3.3095 5.2648 1.1596 2.7593 1.2267 1.0880 1.3644 1.0864 1.0502 1.0882 1.0545 2.9697 7.4711 4.9893 2.4512 1.9043 1.0655 1.0910 1.0314 1.0340 1.0564 1.1040 1.0975 1.0886 1.1028 1.1054 1.0919 1.0948 1.1117 1.0664 1.0448 1.1033
irintensity: 5.7142 1.1861 5.9700 3.5423 0.0744 1.2861 4.0252 7.5841 0.1995 4.0620 1.6565 1.5024 22.7226 2.9096 33.2355 14.9222 6.8181 21.0423 9.1440 49.5416 5.9330 60.4199 11.4285 5.3943 19.2106 2.1324 32.6365 215.0351 23.5810 14.2159 30.9875 216.1208 1.5396 8.3064 1.2212 4.1775 27.6094 21.3824 18.0584 8.0263 39.5978 3.4200 40.9875 15.3026 10.0991 21.6289 9.0196 70.1360 48.9725 31.9629 50.8425 26.4866 64.9012 6.1714 5.4000 7.3281 93.3171 18.8510 9.7584 24.0927 10.2122 0.4709 31.2690 167.8051 20.9006 23.2474 49.1789 207.9401 88.7398 19.4610 77.9931 1.0989 15.7301 10.8265 11.7173 24.6855 70.8281 24.2967 99.4540 55.1360 259.0111 62.2341 318.6005 82.1866 20.1843 44.0062 81.6917 4.1466 26.0221 42.0152 22.3696 29.0172 17.1844 20.4859 11.9130 0.7872 46.8463 32.0006 20.5746
temp: 298.150 k
press: 1.00000 atm
elementType: 16 8 8 8 8 8 7 7 6 6 6 6 6 6 6 6 6 6 6 1 1 1 1 1 1 1 1 1 1 1 1 1 1 1 1
symmnumber: 1
zpe: 694836.9 jmol-1
zpe.correction: 0.264649 hartree
zpe.thermalcorrener: 0.286431 hartree
zpe.thermalcorrenthalpy: 0.287376 hartree
zpe.thermalcorrgfe: 0.211509 hartree
zpe.sumelectzpe: -1310.789055 hartree
zpe.sumelectthermal: -1310.767273 hartree
zpe.sumelectthermalent: -1310.766329 hartree
zpe.sumelectthermalfe: -1310.842196 hartree
dipole: -1.2316 3.5463 -1.5949
dipole: 4.0788
quadrupole: -119.3278 -88.7683 -127.4278
quadrupole: -10.2979 12.3835 -1.7767
quadrupole: -7.4865 23.0730 -15.5865 -10.2979 12.3835 -1.7767
hfenergy: -1311.0537044 hartree
pointgroup: C01 [X(C11H16N2O5S1)]
dipole: 0.6285717 -1.3409412 -0.6179623 debye
polarizability: 263.0796897|-1.6304281|208.6197804|-15.2540783|-7.4662277|110.6534454 unknown
InChI: InChI=1S/C11H16N2O5S/c1-17-9-4-3-8(7-10(9)18-2)11(12)13-5-6-19(14,15)16/h3-4,7,14H,5-6,12H2,1-2H3
charge 0 multiplicity 1
35 atoms
S  3.06509 1.380688 0.078928
O  -2.600362 1.675857 -0.492577
O  -4.713358 -0.19788 0.131703
O  4.557343 2.402783 -0.437996
O  3.175779 1.094205 1.662686
O  1.778242 2.165178 -0.517961
N  1.663736 -1.06347 -0.259005
N  0.978347 -3.362296 -0.18653
C  3.740331 -0.119456 -0.967633
C  3.089529 -1.370475 -0.387139
C  -0.690995 -1.54421 -0.084964
C  0.731122 -1.991721 -0.179238
C  -0.965608 -0.170599 -0.30919
C  -2.277707 0.334607 -0.240424
C  -1.763498 -2.419676 0.218141
C  -3.360388 -0.550903 0.080505
C  -3.077725 -1.918029 0.297937
C  -1.489613 2.580674 -0.839215
C  -5.11252 1.089354 0.740071
H  3.39186 0.133894 -1.979801
H  4.831509 -0.033113 -0.858913
H  3.330369 -2.216144 -1.078133
H  3.543381 -1.603963 0.599555
H  -0.115846 0.481057 -0.534075
H  -1.600188 -3.479874 0.443496
H  -3.920715 -2.570098 0.5456
H  1.928107 -3.722143 -0.146042
H  0.217583 -4.033086 -0.246977
H  4.383173 3.346317 -0.159068
H  -1.004997 2.26659 -1.782038
H  -0.726949 2.614702 -0.040988
H  -1.96048 3.566782 -0.964827
H  -4.76946 1.939472 0.131724
H  -4.703154 1.175637 1.764379
H  -6.211838 1.044934 0.777207
