program: Gaussian 09
title: 000211246
version: EM64L-G09RevD.01
frameworkgroup: C1[X(C12H15NO4)]
method: RPBEPBE
basis: SDD
operation: Freq
keyword: #p
keyword: freq=noraman
keyword: PBEPBE/SDD
title: #p freq=noraman PBEPBE/SDD
converged: YES YES NO NO
title: Mulliken charges:
elementType: O O O O N C C C C C C C C C C C C H H H H H H H H H H H H H H H
charge: -0.481630 -0.260515 -0.248802 -0.264105 -0.620255 0.072024 -0.402979 0.373986 -0.530497 0.146094 -0.403419 -0.369919 0.231537 -0.220062 -0.239818 -0.240647 -0.501802 0.237645 0.268324 0.236569 0.251375 0.277328 0.257145 0.366082 0.226206 0.225610 0.228515 0.315742 0.333095 0.241701 0.247416 0.248059
chargesum: 0.00000
title: Mulliken charges with hydrogens summed into heavy atoms:
elementType: O O O O N C C C C C C C C C C C C
charge: -0.115548 -0.260515 -0.248802 -0.264105 0.028582 0.072024 0.102990 0.373986 -0.042554 0.146094 -0.126091 -0.112775 0.231537 0.006143 -0.014208 -0.012132 0.235375
polarizability: 1.69422278e+02 1.65216400e+01 1.20447718e+02 9.38446551e+00 -8.19205997e+00 1.44376887e+02
1716.lowfreq: -7.9209 -0.0010 -0.0009 -0.0008 5.4072 9.6082 28.0462 29.9227 40.4535
frequency: 28.0180 29.8002 40.4260 56.7046 65.3777 78.4648 96.0148 96.7066 167.4299 183.5739 198.6282 221.9389 255.5327 271.6763 305.3513 340.3340 354.0908 403.5157 419.4410 440.0872 492.8343 501.6687 513.0442 523.1806 548.1991 606.0709 616.1886 640.1053 674.7588 698.2176 710.8225 758.7917 772.3713 782.7687 851.1820 859.7956 882.6818 931.1895 934.6960 949.2598 984.5868 989.8082 1001.1504 1028.9329 1038.5991 1047.5706 1071.3072 1088.4645 1100.1014 1114.1185 1150.6582 1160.4588 1169.1390 1176.4797 1189.6439 1205.7031 1260.1534 1286.8171 1312.5861 1333.9512 1349.1482 1370.0351 1381.0267 1421.6185 1433.0806 1444.3197 1453.7995 1456.3586 1462.5848 1475.8188 1590.9684 1594.7677 1603.6549 1612.1851 1641.2537 2980.9639 3010.9247 3023.6248 3059.4705 3099.6830 3116.6002 3123.8700 3134.0005 3148.3064 3159.0078 3160.0073 3171.3146 3458.1206 3515.8897 3673.4939
redmass: 5.6486 4.1814 4.2975 5.8259 4.3925 3.1583 1.9896 1.4363 4.3682 3.2082 5.9066 5.5123 4.3973 4.5908 3.5955 3.5520 6.7829 2.6855 2.5389 1.3105 2.4631 2.8238 1.9171 2.4189 2.3443 2.8656 6.3734 3.0903 2.3109 5.8611 1.7599 4.2860 1.7259 1.9463 3.8335 1.2530 4.1839 1.5503 5.6285 2.8110 1.4908 4.2720 1.3391 2.1604 2.0769 3.0329 1.8588 2.6490 2.0220 1.2656 1.4476 2.4413 1.2216 1.8025 1.2459 2.1885 1.4082 1.2528 1.3417 1.7976 1.4947 2.2966 8.5027 1.1992 2.2087 1.0957 1.0508 1.0969 1.0578 2.1543 6.1826 1.4461 7.3952 7.1525 3.5419 1.0632 1.0292 1.0626 1.0959 1.1009 1.1051 1.0847 1.0888 1.0934 1.1054 1.0971 1.0974 1.0647 1.0446 1.1043
irintensity: 12.2020 0.9471 4.3317 3.0075 0.7834 0.9871 0.4331 0.3688 11.3388 1.1377 0.1769 3.5423 6.1916 3.1485 4.2708 55.6746 5.8514 5.5257 4.4969 100.3236 4.6397 18.8451 74.1709 79.6459 81.7926 52.0239 0.4873 11.3257 39.5782 5.2299 67.1453 1.5977 45.0248 4.7599 0.7450 0.1414 7.0009 3.4724 12.2642 15.9729 0.3053 0.7558 1.1942 8.9441 36.9252 14.4332 37.6812 10.4644 49.4925 0.6640 4.0831 166.5051 5.1262 6.3623 7.3831 88.9458 0.9467 38.2518 0.2485 109.6957 31.0680 114.1514 0.6824 17.2465 10.2519 2.9221 15.5772 19.8540 12.5619 24.2620 0.9979 69.4105 87.7835 66.1543 274.4412 13.3608 27.0960 14.2976 10.1622 12.1795 20.4866 0.1658 12.0125 22.5798 10.1773 18.0174 15.2812 41.3707 30.2581 21.9688
temp: 298.150 k
press: 1.00000 atm
elementType: 8 8 8 8 7 6 6 6 6 6 6 6 6 6 6 6 6 1 1 1 1 1 1 1 1 1 1 1 1 1 1 1
symmnumber: 1
zpe: 664747.3 jmol-1
zpe.correction: 0.253189 hartree
zpe.thermalcorrener: 0.270754 hartree
zpe.thermalcorrenthalpy: 0.271698 hartree
zpe.thermalcorrgfe: 0.205575 hartree
zpe.sumelectzpe: -820.662735 hartree
zpe.sumelectthermal: -820.645169 hartree
zpe.sumelectthermalent: -820.644225 hartree
zpe.sumelectthermalfe: -820.710349 hartree
dipole: 0.8330 1.7004 1.1151
dipole: 2.1975
quadrupole: -81.7868 -93.7791 -103.1210
quadrupole: 1.2114 14.1178 -11.4505
quadrupole: 11.1088 -0.8835 -10.2254 1.2114 14.1178 -11.4505
hfenergy: -820.9159237 hartree
pointgroup: C01 [X(C12H15N1O4)]
dipole: -0.3317518 -0.7938526 0.0848534 debye
polarizability: 169.5753965|18.8685004|118.5920016|-0.5991996|-4.5099467|146.0794858 unknown
InChI: InChI=1S/C12H15NO4/c1-17-11(15)12(16,8-7-10(13)14)9-5-3-2-4-6-9/h2-6,16H,7-8,13H2,1H3
charge 0 multiplicity 1
32 atoms
O  -0.190662 -0.809178 1.950393
O  -0.35268 -1.545184 -1.615523
O  0.01476 -2.884473 0.248996
O  -3.477863 1.75772 -1.066972
N  -4.741072 1.115155 0.767427
C  -0.011118 -0.434524 0.544091
C  -1.120541 0.586751 0.195064
C  1.392621 0.181217 0.308232
C  -2.541971 0.041653 0.433537
C  -0.118169 -1.748489 -0.27233
C  2.252089 0.39768 1.411123
C  1.813883 0.572823 -0.988579
C  -3.60473 1.048151 -0.025118
C  3.520338 0.992324 1.221486
C  3.080936 1.167555 -1.174987
C  3.940316 1.378451 -0.071455
C  -0.393417 -2.766146 -2.465003
H  -0.947743 1.476673 0.827633
H  -1.023468 0.907036 -0.855121
H  -2.692934 -0.879572 -0.16584
H  -2.666678 -0.232289 1.495639
H  1.906664 0.111171 2.408599
H  1.158151 0.409546 -1.850555
H  0.067559 -1.76884 2.038121
H  4.1765 1.15703 2.083727
H  3.396391 1.467389 -2.180771
H  4.923238 1.84017 -0.218381
H  -4.835232 0.571384 1.623161
H  -5.492932 1.746456 0.4903
H  -0.626765 -2.395191 -3.471928
H  -1.173252 -3.453924 -2.099089
H  0.585482 -3.272423 -2.438976
