program: Gaussian 09
title: 000211236
version: EM64L-G09RevD.01
frameworkgroup: C1[X(C17H15I3N2O4)]
method: RPBEPBE
basis: SDD
operation: Freq
keyword: #p
keyword: freq=noraman
keyword: PBEPBE/SDD
title: #p freq=noraman PBEPBE/SDD
converged: YES YES NO NO
title: Mulliken charges:
elementType: I I I O O O O N N C C C C C C C C C C C C C C C C C H H H H H H H H H H H H H H H
charge: 0.094560 0.104282 0.110914 -0.270358 -0.234696 -0.411140 -0.201256 -0.456707 -0.683312 -0.815608 0.772780 0.496988 0.261385 -0.720219 -0.592058 0.403231 -0.469742 0.844441 -0.064679 -0.489488 -0.092815 -0.593228 -0.415412 -0.167620 -0.712525 0.166286 0.261242 0.278961 0.315151 0.325872 0.251707 0.222040 0.269624 0.254428 0.227942 0.242487 0.241448 0.230626 0.314036 0.314133 0.386300
chargesum: 0.00000
title: Mulliken charges with hydrogens summed into heavy atoms:
elementType: I I I O O O O N N C C C C C C C C C C C C C C C C C
charge: 0.094560 0.104282 0.110914 -0.270358 -0.234696 -0.024841 -0.201256 -0.141555 -0.055143 -0.275406 0.772780 0.496988 0.261385 -0.720219 -0.592058 0.403231 -0.143870 0.844441 0.187029 -0.267448 0.176809 -0.593228 -0.160984 0.060322 0.002037 0.166286
polarizability: 3.62930513e+02 -3.48623551e+01 2.87105111e+02 6.21872085e+01 4.23852211e+00 2.39557181e+02
1716.lowfreq: -7.0282 -4.1042 -0.0007 -0.0006 -0.0005 1.0678 3.6720 8.4054 13.5002
frequency: 1.5980 8.3334 13.4697 18.2353 35.9420 36.3537 43.8328 62.1916 69.7599 83.6001 88.4914 91.3784 104.3635 123.8693 140.5646 159.0890 176.2364 212.1324 220.1221 233.2929 243.4766 266.2570 269.5349 281.2066 290.0999 299.3239 323.2902 334.0149 349.9386 369.0659 386.3476 436.6172 455.0554 483.0355 493.1186 501.7466 517.0264 534.2016 558.4870 571.3177 597.3057 598.5541 605.2622 610.5293 617.5830 635.4745 649.1015 688.0858 701.3246 722.3000 734.4908 758.4758 777.9379 788.3073 799.7211 870.7397 879.0298 895.3489 912.8141 919.2870 924.6813 962.6225 976.9093 984.0626 994.0923 1001.6162 1021.7480 1038.4756 1071.9457 1085.5069 1092.9431 1133.8971 1144.7760 1168.5789 1177.0685 1193.5431 1229.9464 1242.4084 1272.7532 1281.3736 1294.1625 1304.6837 1315.4906 1341.3709 1352.9262 1388.8682 1389.7809 1394.4320 1426.5836 1443.0707 1446.4107 1463.6892 1476.7561 1479.8368 1514.7746 1527.2019 1570.8376 1606.7107 1613.7582 1629.6158 1632.1448 1679.6021 2983.7880 3005.1205 3012.6544 3040.6890 3112.6236 3113.9709 3120.5121 3150.0611 3177.9750 3182.6864 3183.6262 3517.2346 3522.4082 3523.7223 3658.1618
redmass: 7.4844 17.3796 16.0825 7.0834 8.2364 8.7488 8.8358 9.0677 6.6551 7.3233 5.9410 11.4538 24.8751 5.7505 7.8799 116.8994 5.7406 5.1774 1.0949 2.9333 4.8649 6.1591 5.8412 4.6392 6.4557 6.0450 4.9603 6.9179 5.0555 5.2630 2.9431 1.0631 3.0370 1.3272 3.7192 4.0179 2.6464 6.7285 4.5390 2.2483 2.2897 4.4535 5.2447 3.8149 3.4192 1.6299 6.7807 2.1211 3.6670 6.9535 5.9899 5.3004 2.8675 1.7119 7.3764 1.4564 1.3920 2.9022 1.5084 5.3201 2.3572 1.3268 4.3950 3.9835 2.9031 9.4711 2.6532 2.1786 1.8736 1.5806 2.1350 2.1489 1.9123 1.3496 1.3884 2.0438 1.5783 1.5198 2.1771 2.3069 1.7211 1.5132 1.3442 1.5681 5.1129 5.2886 1.2927 5.3464 3.4838 1.4958 2.2740 1.0476 1.0983 2.3149 2.1102 7.5932 4.6203 6.4946 6.1905 4.2336 1.4099 9.1803 1.0597 1.0345 1.0847 1.0996 1.1005 1.1014 1.0887 1.0923 1.0968 1.0925 1.0931 1.0456 1.0643 1.0762 1.1036
irintensity: 0.0484 0.0318 0.0620 1.7178 0.0429 1.2328 4.8310 0.2168 0.1470 2.9906 0.2969 2.2346 0.7513 0.8748 0.0390 0.0129 2.3384 2.4492 0.1514 0.8860 5.2776 1.6465 7.2787 3.0211 0.1712 7.0658 0.9123 7.2032 2.3229 1.9175 1.6141 9.9048 6.4814 232.3795 20.1723 13.9049 0.4061 4.0772 4.0613 43.4164 100.0607 7.1087 13.3201 19.6029 40.8311 19.1845 12.4603 43.7034 25.1525 31.0967 7.0917 20.1590 12.8777 69.4141 10.3133 0.6413 10.0935 7.8740 17.8253 40.5072 33.0052 1.0936 34.1949 28.3905 35.8389 10.4228 250.6884 28.8683 75.9476 4.3434 36.7391 2.3827 67.3928 75.6565 6.5401 134.4527 24.8931 13.4949 34.7216 7.0616 40.3386 27.2681 5.9680 11.6800 33.9618 17.6807 15.5331 30.8381 246.3213 52.8572 164.1472 12.2893 13.5015 27.8408 392.9719 42.1293 0.4767 159.7239 149.9123 58.7984 247.7350 177.5224 21.8204 15.1861 11.4550 2.3729 13.4775 15.0790 13.0426 19.5285 6.4596 18.6463 0.0412 61.9018 25.6646 13.9923 62.4249
temp: 298.150 k
press: 1.00000 atm
elementType: 53 53 53 8 8 8 8 7 7 6 6 6 6 6 6 6 6 6 6 6 6 6 6 6 6 6 1 1 1 1 1 1 1 1 1 1 1 1 1 1 1
symmnumber: 1
zpe: 761091.6 jmol-1
zpe.correction: 0.289884 hartree
zpe.thermalcorrener: 0.317034 hartree
zpe.thermalcorrenthalpy: 0.317978 hartree
zpe.thermalcorrgfe: 0.221784 hartree
zpe.sumelectzpe: -1099.865581 hartree
zpe.sumelectthermal: -1099.838432 hartree
zpe.sumelectthermalent: -1099.837488 hartree
zpe.sumelectthermalfe: -1099.933682 hartree
dipole: 2.3336 3.4737 -0.3880
dipole: 4.2027
quadrupole: -199.5367 -185.6152 -177.2345
quadrupole: -6.8447 7.2947 -5.8129
quadrupole: -12.0746 1.8469 10.2277 -6.8447 7.2947 -5.8129
hfenergy: -1100.1554658 hartree
pointgroup: C01 [X(C17H15I3N2O4)]
dipole: -1.0216283 0.5307265 -1.1868563 debye
polarizability: 337.0021713|86.2125051|270.0194211|-4.6252649|-15.8322581|282.571212 unknown
InChI: InChI=1S/C17H15I3N2O4/c1-8(17(24)25)26-10-4-2-3-9(5-10)22-14(23)6-11-12(18)7-13(19)16(21)15(11)20/h2-5,7-8,22,24H,6,21H2,1H3
charge 0 multiplicity 1
41 atoms
I  -2.613023 1.324982 -2.826679
I  -2.694128 0.487424 3.369342
I  -6.526499 -2.644266 -0.130401
O  4.721442 -0.673475 -0.545705
O  -0.135643 -0.088859 0.178895
O  2.328242 -2.883589 1.096978
O  3.890608 -1.483263 2.111996
N  0.619007 2.109964 -0.164569
N  -4.95551 -0.898254 -2.4559
C  -1.754332 1.773567 0.355412
C  -2.86868 0.758255 0.231068
C  2.019549 1.928119 -0.367783
C  -0.356268 1.152798 0.105264
C  -3.410024 0.39957 -1.031541
C  -3.415621 0.105522 1.369785
C  4.017796 0.546838 -0.540407
C  2.620368 0.643021 -0.352763
C  -4.453345 -0.567336 -1.21299
C  3.971397 -1.916379 -0.34946
C  2.805494 3.08956 -0.582313
C  -4.445701 -0.85009 1.250049
C  -4.95183 -1.174119 -0.016841
C  4.816252 1.695246 -0.754179
C  4.197461 2.959892 -0.774569
C  4.95754 -3.059602 -0.634133
C  3.431972 -2.022688 1.088594
H  -1.919906 2.616594 -0.341299
H  -1.749355 2.192109 1.379794
H  0.299047 3.08038 -0.215481
H  1.979022 -0.224177 -0.187105
H  3.111253 -1.964966 -1.044418
H  2.336976 4.081378 -0.592349
H  -4.849405 -1.338995 2.138434
H  5.894273 1.576717 -0.892279
H  4.805937 3.855708 -0.937533
H  5.818294 -3.000323 0.052811
H  5.326292 -2.975608 -1.669794
H  4.457139 -4.034684 -0.508841
H  -5.69485 -1.593339 -2.538997
H  -4.574887 -0.473865 -3.299025
H  1.957145 -2.95637 2.017631
