program: Gaussian 09
title: 000216524
version: EM64L-G09RevD.01
frameworkgroup: C1[X(C15H19ClN2)]
method: RPBEPBE
basis: SDD
operation: Freq
keyword: #p
keyword: freq=noraman
keyword: PBEPBE/SDD
title: #p freq=noraman PBEPBE/SDD
converged: YES YES NO NO
title: Mulliken charges:
elementType: Cl N N C C C C C C C C C C C C C C C H H H H H H H H H H H H H H H H H H H
charge: -0.091303 -0.195357 -0.112412 -0.482442 -0.380222 -0.511048 0.194520 -0.288159 0.352921 0.136204 0.322909 -0.776701 -0.808388 -0.317134 -0.384538 -0.804636 -0.096993 -0.267522 0.234186 0.236642 0.225231 0.246130 0.233116 0.270241 0.272654 0.214151 0.231955 0.217257 0.224091 0.252164 0.224085 0.255818 0.233210 0.230037 0.213592 0.244053 0.251689
chargesum: 0.00000
title: Mulliken charges with hydrogens summed into heavy atoms:
elementType: Cl N N C C C C C C C C C C C C C C C
charge: -0.091303 -0.195357 -0.112412 -0.011614 0.091139 -0.007691 0.194520 -0.015505 0.352921 0.136204 0.322909 -0.113338 -0.108048 -0.061316 -0.151328 -0.116955 -0.096993 -0.015832
polarizability: 3.30033050e+02 -3.02072303e-01 1.87543757e+02 8.39628435e+00 1.06043438e+01 1.21363765e+02
1716.lowfreq: -9.5181 -2.6876 -0.0013 -0.0013 0.0017 4.2326 16.8514 42.0707 50.5728
frequency: 16.6701 42.0079 50.5705 60.5348 95.6101 100.6421 115.6695 121.2537 139.3604 142.8651 184.6137 210.4846 213.9084 233.6977 260.4899 280.9311 309.3972 335.5385 347.3030 354.8014 379.2604 445.3780 457.7189 467.0783 478.9444 538.6254 563.1102 609.0380 624.8467 632.3493 679.6505 717.8031 758.0452 781.3605 799.0277 814.2737 846.8845 861.5813 876.4490 889.0603 909.5334 933.4978 944.7275 958.1070 986.3982 1000.8698 1003.9633 1039.8156 1043.7671 1066.2211 1074.8303 1079.3090 1081.7471 1126.6505 1153.9404 1185.1333 1189.5268 1204.4902 1224.6837 1234.2015 1261.7298 1275.5390 1291.3813 1301.0859 1319.6859 1355.8351 1366.0997 1381.8516 1391.7076 1395.4725 1397.5866 1410.3390 1452.5891 1456.0620 1457.5595 1469.2513 1471.9047 1473.1441 1474.3675 1476.6112 1483.6870 1499.8431 1560.7628 1595.7335 1639.1571 1693.5409 2952.9703 2960.7265 2968.1092 2977.9130 3000.7197 3019.8635 3020.4377 3022.2166 3055.1078 3062.0658 3078.1248 3081.8433 3086.4946 3094.9232 3121.0018 3129.7697 3134.9451 3165.8694 3176.2667
redmass: 4.7090 2.7515 4.1088 5.1760 1.5124 1.5570 1.9661 4.2576 2.2401 1.5931 1.3854 2.7608 2.5517 2.6516 4.5811 4.0814 3.7627 3.2983 3.6341 7.2090 3.0594 2.9809 2.8079 3.3374 3.5696 3.0552 4.7633 5.0414 4.6846 3.4406 5.6098 3.5960 4.3838 3.4937 1.2796 3.5735 1.5084 2.7634 2.0329 1.3947 1.8103 1.3298 2.3657 1.3949 1.5335 2.2754 1.3158 1.9630 1.5302 1.7015 1.6980 1.8364 2.0115 1.5581 1.2579 2.4574 1.7220 2.6976 1.3331 2.5001 1.4498 2.0113 1.4248 2.7804 1.5601 4.8295 2.0803 1.9134 1.2376 1.5071 1.5402 1.4826 1.0543 1.0532 1.0985 1.0494 1.2727 1.3236 1.3919 1.1013 1.1841 1.0855 7.7588 6.7684 10.7048 6.4799 1.0380 1.0418 1.0663 1.0366 1.0658 1.0661 1.0947 1.0950 1.0962 1.0965 1.0970 1.0974 1.1001 1.1046 1.0922 1.0897 1.0892 1.0915 1.0952
irintensity: 0.4763 0.0560 1.0473 1.8574 0.8444 0.5183 0.3419 2.3712 0.4570 0.1088 0.6523 0.6041 1.5729 0.7793 0.7530 3.5151 1.3048 0.5676 2.9415 6.2864 0.7759 7.1540 10.0114 7.8425 2.5782 2.3599 6.9788 12.0142 5.5503 14.1630 21.3200 7.6591 2.7400 1.9700 38.3353 6.6649 23.8158 79.8413 12.1047 7.1109 4.2174 0.0248 7.0372 1.6987 32.1111 14.6948 8.9639 2.8615 8.4496 34.5101 23.5602 3.2048 17.2312 14.8311 3.8043 14.2645 12.8667 32.1904 13.2897 46.8194 37.3099 39.2151 61.5217 200.4497 30.2272 1.9588 168.7899 21.1719 21.2083 13.3595 24.5992 47.0280 15.5687 2.7379 1.1411 8.1838 32.2816 39.4086 53.5692 3.9607 7.7439 5.4066 28.3297 356.3150 896.6374 50.5947 56.2961 96.5053 75.0941 29.7951 17.1159 27.4248 21.2433 37.4485 18.8735 27.5927 8.9617 32.8075 28.6328 33.8695 22.9884 21.5345 19.3094 4.7286 3.1182
temp: 298.150 k
press: 1.00000 atm
elementType: 17 7 7 6 6 6 6 6 6 6 6 6 6 6 6 6 6 6 1 1 1 1 1 1 1 1 1 1 1 1 1 1 1 1 1 1 1
symmnumber: 1
zpe: 799943.7 jmol-1
zpe.correction: 0.304682 hartree
zpe.thermalcorrener: 0.323461 hartree
zpe.thermalcorrenthalpy: 0.324405 hartree
zpe.thermalcorrgfe: 0.256087 hartree
zpe.sumelectzpe: -1151.214596 hartree
zpe.sumelectthermal: -1151.195817 hartree
zpe.sumelectthermalent: -1151.194873 hartree
zpe.sumelectthermalfe: -1151.263191 hartree
dipole: -4.5901 -1.2593 2.0632
dipole: 5.1876
quadrupole: -113.2272 -106.4510 -116.3475
quadrupole: 10.4330 3.9701 -1.0054
quadrupole: -1.2186 5.5576 -4.3389 10.4330 3.9701 -1.0054
hfenergy: -1151.5192783 hartree
pointgroup: C01 [X(C15H19Cl1N2)]
dipole: 1.768399 -0.5170866 0.8780334 debye
polarizability: 330.1214311|-6.0690501|152.2805396|-1.4647988|34.9135106|156.5386015 unknown
InChI: InChI=1S/C15H19ClN2/c1-11(2)10-18-8-4-5-15(18)17-14-9-13(16)7-6-12(14)3/h6-7,9-10H,4-5,8H2,1-3H3
charge 0 multiplicity 1
37 atoms
Cl -4.645071 2.21045 0.744039
N  2.028048 0.112378 0.788958
N  -0.082405 -0.252772 -0.225783
C  1.458123 0.027275 3.103102
C  2.616602 0.359391 2.128925
C  0.186903 0.339779 2.276498
C  0.623249 0.055765 0.83523
C  2.732939 -0.139812 -0.409884
C  4.05472 0.028809 -0.721023
C  -1.490174 -0.246825 -0.283173
C  -2.141813 -1.319613 -0.981168
C  4.524975 -0.406634 -2.101565
C  5.154747 0.626899 0.140483
C  -2.272914 0.828291 0.234792
C  -3.548006 -1.288818 -1.11141
C  -1.321023 -2.454912 -1.556684
C  -3.666892 0.810216 0.072254
C  -4.335649 -0.233018 -0.590154
H  1.5208 0.612668 4.035037
H  1.484278 -1.044991 3.366031
H  2.936001 1.416096 2.229699
H  3.496967 -0.286979 2.282811
H  -0.098039 1.403873 2.383524
H  -0.691871 -0.264057 2.555856
H  2.048163 -0.525939 -1.173297
H  5.32318 -1.173315 -2.027693
H  3.704046 -0.83092 -2.704756
H  4.95703 0.446843 -2.662103
H  5.68991 1.409787 -0.433135
H  4.799677 1.09001 1.071963
H  5.91449 -0.137604 0.402769
H  -1.786527 1.680621 0.717198
H  -4.048909 -2.108901 -1.639167
H  -0.815709 -3.033716 -0.760709
H  -1.95134 -3.148037 -2.140241
H  -0.5191 -2.062469 -2.208242
H  -5.422406 -0.222521 -0.707083
