program: Gaussian 09
title: 000211233
version: EM64L-G09RevD.01
frameworkgroup: C1[X(C19H19I3N2O4)]
method: RPBEPBE
basis: SDD
operation: Freq
keyword: #p
keyword: freq=noraman
keyword: PBEPBE/SDD
title: #p freq=noraman PBEPBE/SDD
converged: YES YES NO NO
title: Mulliken charges:
elementType: I I I O O O O N N C C C C C C C C C C C C C C C C C C C H H H H H H H H H H H H H H H H H H H
charge: 0.138956 0.136814 0.119387 -0.280628 -0.412609 -0.203523 -0.208923 -0.418305 -0.677383 -0.422282 -0.353134 -0.117056 -0.346312 -0.698114 0.149678 0.413907 -0.456027 0.519183 -0.422843 -0.480594 -0.170394 0.448596 0.030124 -0.687403 -0.546657 0.829819 -0.113971 -0.576496 0.223195 0.221878 0.224586 0.198721 0.266130 0.190835 0.196204 0.213557 0.215190 0.211427 0.321706 0.253824 0.225238 0.228124 0.332163 0.383287 0.271795 0.313055 0.315273
chargesum: 0.00000
title: Mulliken charges with hydrogens summed into heavy atoms:
elementType: I I I O O O O N N C C C C C C C C C C C C C C C C C C C
charge: 0.138956 0.136814 0.119387 -0.280628 -0.029322 -0.203523 -0.208923 -0.086142 -0.049055 0.022791 0.070173 0.149075 0.040727 -0.057940 0.149678 0.413907 -0.134321 0.519183 -0.169019 -0.255356 0.057730 0.448596 0.030124 -0.687403 -0.546657 0.829819 0.157825 -0.576496
polarizability: 4.52199189e+02 1.49807663e+01 3.00754008e+02 2.36687687e+01 -9.15972210e-01 2.22230490e+02
1716.lowfreq: -6.4600 -0.0008 -0.0006 -0.0005 1.7618 3.4167 7.4300 12.8072 14.1282
frequency: 4.6291 12.7230 14.1202 19.8606 30.7983 38.7061 46.7222 52.2003 62.7056 67.5468 79.1134 84.2615 91.1209 97.2952 100.9009 120.4840 127.9876 132.9188 155.4589 160.1620 191.2233 218.2787 223.3797 228.2218 256.7593 262.3195 270.9710 291.9238 297.4347 312.1516 317.3901 348.2626 366.0968 389.0477 428.9132 445.4794 452.2370 455.6682 489.3507 498.0664 506.6574 511.8948 550.4046 560.2438 600.0274 605.6948 612.1764 624.7409 653.0978 663.3954 687.3851 695.4326 704.0660 708.4185 728.5926 743.9128 763.0300 786.8486 788.3522 817.7357 821.9075 872.9724 878.4505 894.4547 902.1323 915.9749 948.1069 958.0788 963.9062 976.1474 982.2528 1001.6311 1004.1284 1032.8811 1051.7960 1061.5648 1086.7613 1096.1855 1112.3418 1139.1472 1144.7763 1169.0529 1183.1444 1218.4397 1228.7479 1237.3595 1250.2875 1270.9894 1276.7424 1282.8342 1295.0611 1297.6370 1304.0680 1337.1901 1344.6909 1346.1095 1370.1272 1371.0762 1390.7421 1396.1838 1428.8588 1438.4292 1449.1510 1467.4527 1476.0631 1476.4971 1478.0274 1487.6114 1512.2696 1518.2723 1564.1596 1603.8131 1607.5979 1614.5582 1627.7062 1675.4364 2962.6035 2973.1412 2978.1956 2990.8523 3004.5731 3008.0000 3040.6518 3064.5882 3071.9420 3073.1197 3123.9124 3151.0325 3177.2209 3179.7638 3188.4759 3512.3697 3518.3562 3521.8102 3654.3648
redmass: 7.8630 7.9086 11.6732 9.5484 5.6643 5.7211 5.0959 6.5189 1.7194 8.7285 9.7964 7.5375 10.8279 7.5851 11.0481 2.6142 8.0494 6.7485 5.5183 87.7936 5.7446 3.8541 1.1814 6.5127 2.6446 5.9535 5.1894 6.3168 5.5089 8.0897 6.0059 6.6678 6.3083 2.9394 4.0427 3.1975 1.3456 2.8010 1.6289 2.5477 3.9961 3.6104 6.7163 2.0825 4.1269 4.0980 7.0367 2.4602 1.3100 7.6407 2.0106 6.9088 5.4811 8.7328 1.1932 4.0211 3.6049 1.8029 1.7632 6.4264 2.6988 1.4561 1.3702 1.8640 1.4878 1.7945 4.6259 2.0176 1.3260 4.1277 5.0526 3.6988 10.5665 2.4061 1.7144 2.6734 1.5882 2.1738 2.6796 2.4691 1.7765 1.3405 1.7184 1.3484 2.5157 1.4339 1.5235 2.1097 2.4130 1.2180 1.1434 1.3491 1.3680 1.4233 1.5341 5.7331 1.7285 4.3161 1.2215 7.5537 3.5723 4.9559 1.0851 1.0690 1.0605 1.0490 2.5692 1.0822 2.2411 7.5244 4.4402 7.3828 6.4391 4.7411 1.3704 9.3739 1.0588 1.0372 1.0630 1.0712 1.0739 1.0958 1.0997 1.1025 1.1000 1.1010 1.0886 1.0922 1.0971 1.0930 1.0923 1.0456 1.0643 1.0768 1.1038
irintensity: 0.1257 0.0454 0.0824 0.5044 0.3659 1.2123 2.4602 0.8141 0.4834 0.1278 0.7847 0.5763 0.7052 2.1716 1.6083 0.0631 0.8857 0.6176 0.1474 0.0185 1.3965 0.1735 0.0846 3.0019 1.2093 4.7804 2.4772 6.1943 0.9948 10.9610 3.0532 1.1282 5.0083 1.1881 14.2717 7.5794 5.3089 5.8577 197.2029 34.6020 22.3396 14.5394 3.8797 56.9723 11.1459 38.1603 26.9187 89.8345 26.3767 5.8922 26.7049 10.8767 41.8843 4.4250 10.4471 17.0046 23.1091 45.0754 28.3642 15.4923 3.3550 0.8968 11.7957 5.9456 20.7748 10.9426 49.7497 16.4476 0.9620 5.3960 5.8779 202.3753 25.3256 134.4508 130.9084 1.4474 7.8662 2.9966 32.1286 29.8678 3.0735 76.5796 57.1594 3.4416 155.6305 6.8629 13.7652 20.2705 6.9972 3.0906 1.0455 13.0093 19.4428 5.7960 13.0666 21.4775 4.6445 18.4977 11.2486 20.6213 222.9164 189.7039 7.5470 0.2431 5.5080 10.0848 25.6553 16.2668 396.2702 126.4792 1.7825 230.5044 112.0915 82.2928 265.4253 171.4193 27.8517 32.9388 26.1967 9.0228 32.9987 15.9125 2.3610 0.9355 66.5574 95.1455 11.3822 17.8053 7.9272 0.0281 17.6938 65.3608 27.0413 18.5651 68.2015
temp: 298.150 k
press: 1.00000 atm
elementType: 53 53 53 8 8 8 8 7 7 6 6 6 6 6 6 6 6 6 6 6 6 6 6 6 6 6 6 6 1 1 1 1 1 1 1 1 1 1 1 1 1 1 1 1 1 1 1
symmnumber: 1
zpe: 906721.3 jmol-1
zpe.correction: 0.345352 hartree
zpe.thermalcorrener: 0.375510 hartree
zpe.thermalcorrenthalpy: 0.376454 hartree
zpe.thermalcorrgfe: 0.274787 hartree
zpe.sumelectzpe: -1178.308500 hartree
zpe.sumelectthermal: -1178.278342 hartree
zpe.sumelectthermalent: -1178.277398 hartree
zpe.sumelectthermalfe: -1178.379065 hartree
dipole: -2.5230 -1.1092 1.1590
dipole: 2.9898
quadrupole: -188.6220 -197.7150 -201.8502
quadrupole: 14.0685 -8.9460 6.7466
quadrupole: 7.4404 -1.6526 -5.7878 14.0685 -8.9460 6.7466
hfenergy: -1178.653852 hartree
pointgroup: C01 [X(C19H19I3N2O4)]
dipole: 1.0242579 -0.2813378 0.5053482 debye
polarizability: 448.7265133|39.7847518|230.0519368|3.8429781|16.7896488|296.4052372 unknown
InChI: InChI=1S/C19H19I3N2O4/c1-2-3-7-14(19(26)27)28-11-6-4-5-10(8-11)24-18(25)15-12(20)9-13(21)17(23)16(15)22/h4-6,8-9,14,24,26H,2-3,7,23H2,1H3
charge 0 multiplicity 1
47 atoms
I  2.612504 0.408283 2.651857
I  3.138434 -0.167137 -3.50073
I  8.101716 1.044451 -0.171594
O  -3.656941 -0.940109 -0.475435
O  -2.870093 2.506854 0.530997
O  -3.046543 0.603559 1.860871
O  0.903282 0.981748 -0.569906
N  1.295171 -1.33762 -0.421814
N  5.814784 0.933611 2.209581
C  -5.033018 0.986402 -0.959121
C  -6.116285 0.665812 0.093188
C  -3.6103 0.518654 -0.576665
C  -7.527848 1.071656 -0.387711
C  -8.620611 0.783256 0.663952
C  -3.150041 1.150445 0.747608
C  -2.448166 -1.659323 -0.429034
C  -1.173278 -1.051478 -0.463432
C  -0.023409 -1.880376 -0.421932
C  -2.592443 -3.06531 -0.362953
C  -0.150005 -3.291507 -0.358328
C  -1.436831 -3.869505 -0.329542
C  3.196956 0.177162 -0.388412
C  1.686104 -0.007965 -0.472787
C  3.818977 0.425054 0.856929
C  3.998247 0.179442 -1.557757
C  5.22314 0.686366 0.988275
C  5.385918 0.424721 -1.478952
C  5.977933 0.672685 -0.229546
H  -5.285796 0.494859 -1.918194
H  -4.989231 2.076318 -1.145126
H  -6.09513 -0.416263 0.322322
H  -5.89078 1.193279 1.04241
H  -2.899731 0.829166 -1.368431
H  -7.533956 2.15165 -0.642402
H  -7.763702 0.5290 -1.326039
H  -8.650971 -0.293007 0.917725
H  -9.622406 1.073585 0.29741
H  -8.427302 1.341406 1.599429
H  -1.03058 0.028941 -0.507356
H  -3.596677 -3.49682 -0.336133
H  0.742996 -3.927343 -0.326863
H  -1.53851 -4.958632 -0.278321
H  2.054822 -2.021471 -0.365423
H  -2.552717 2.923065 1.377562
H  5.997298 0.425351 -2.383723
H  5.252548 0.95288 3.05846
H  6.813671 1.122406 2.267187
