program: Gaussian 09
title: 000216517
version: EM64L-G09RevD.01
frameworkgroup: C1[X(C9H10ClN2O3PS2)]
method: RPBEPBE
basis: SDD
operation: Freq
keyword: #p
keyword: freq=noraman
keyword: PBEPBE/SDD
title: #p freq=noraman PBEPBE/SDD
converged: YES YES NO NO
title: Mulliken charges:
elementType: Cl S S P O O O N N C C C C C C C C C H H H H H H H H H H
charge: -0.032487 0.019790 -0.256261 0.518397 -0.234106 -0.463523 -0.178840 -0.165288 -0.001852 -0.689497 0.104589 0.267495 0.226065 -0.233671 -0.833201 -0.014868 -0.352181 -0.493327 0.323355 0.317288 0.288471 0.281522 0.274868 0.290550 0.274305 0.283737 0.241903 0.236767
chargesum: 0.00000
title: Mulliken charges with hydrogens summed into heavy atoms:
elementType: Cl S S P O O O N N C C C C C C C C C
charge: -0.032487 0.019790 -0.256261 0.518397 -0.234106 -0.463523 -0.178840 -0.165288 -0.001852 -0.048853 0.104589 0.267495 0.226065 0.056878 0.011659 -0.014868 -0.077876 0.269081
polarizability: 3.08558034e+02 -2.27448830e+01 1.64864125e+02 -1.15429296e+01 1.36761710e+00 1.35968513e+02
1716.lowfreq: -23.4548 -1.3249 -0.0022 -0.0007 0.0017 6.8008 16.3507 29.9580 40.4680
frequency: 13.7107 29.3967 40.4641 68.6249 70.4633 89.6390 103.4795 111.2940 135.9054 155.3771 165.1170 178.4281 180.6362 202.7984 215.8520 236.2324 249.7215 282.3016 303.4778 344.4582 351.7030 354.3990 374.7113 413.8475 435.4351 505.0753 547.8132 574.7407 586.1015 631.1585 644.2331 645.6200 665.8874 690.0190 710.5452 732.4099 756.1953 832.3496 871.9465 876.9966 890.0486 923.5243 952.7410 961.6518 981.0368 1030.6248 1065.4811 1096.6395 1115.8544 1139.7773 1209.6510 1252.7184 1287.7358 1315.0965 1338.5932 1344.9416 1361.7840 1403.2982 1427.2398 1428.4904 1430.0767 1433.3013 1453.1542 1460.3137 1477.2819 1568.9571 1598.5837 1756.2773 2951.0778 2996.3989 3023.5946 3106.8025 3122.0615 3138.3569 3144.3684 3158.3209 3176.2402 3196.1948
redmass: 9.9989 5.7646 8.8909 7.3362 1.4087 11.8807 4.7042 3.3469 6.3429 4.7170 1.0613 3.9056 5.0550 5.9023 4.5051 8.6256 7.6769 2.8643 7.5956 9.7199 9.4441 9.1176 5.1484 12.9539 4.7736 10.6487 9.4172 5.6094 4.7059 8.6339 8.2036 8.0898 9.0897 9.1873 8.9720 7.7451 7.1982 3.8750 4.0324 1.4574 1.3672 4.1716 2.5841 1.5262 1.7569 3.8969 1.8642 5.6772 1.2578 1.2821 3.1000 1.4774 1.6843 1.6004 2.6025 1.1563 5.5190 2.4667 1.1511 1.0490 1.0923 1.0519 3.9746 1.0617 1.0536 9.6099 9.1072 12.3282 1.0708 1.0299 1.0310 1.1030 1.0959 1.1053 1.1023 1.1028 1.0933 1.0953
irintensity: 0.2340 0.3464 0.9135 0.2628 0.8251 1.7637 1.5390 2.1453 2.7424 7.3647 0.3258 2.8279 1.9623 0.3068 4.4088 1.3507 2.0224 4.9136 11.9210 40.7010 5.9967 46.0848 6.7430 9.9656 0.6494 81.5378 15.0629 26.1113 24.8336 68.0457 41.3364 27.4086 12.4752 14.8488 64.1488 18.5186 8.4979 151.8859 56.2336 42.2789 0.3492 8.6246 118.3254 60.9364 27.5217 3.0227 27.3794 4.7023 0.5460 0.7082 52.3209 2.7442 118.7145 48.7001 19.7304 15.1502 98.2863 15.1183 23.3900 4.6894 12.6377 14.7090 473.0442 13.3881 27.4781 24.3428 13.9065 574.3733 38.8460 41.4139 0.4497 10.5498 12.5780 6.5507 0.6995 0.6493 4.2755 1.6926
temp: 298.150 k
press: 1.00000 atm
elementType: 17 16 16 15 8 8 8 7 7 6 6 6 6 6 6 6 6 6 1 1 1 1 1 1 1 1 1 1
symmnumber: 1
zpe: 491048.2 jmol-1
zpe.correction: 0.187030 hartree
zpe.thermalcorrener: 0.206743 hartree
zpe.thermalcorrenthalpy: 0.207687 hartree
zpe.thermalcorrgfe: 0.135849 hartree
zpe.sumelectzpe: -2280.219633 hartree
zpe.sumelectthermal: -2280.199921 hartree
zpe.sumelectthermalent: -2280.198977 hartree
zpe.sumelectthermalfe: -2280.270814 hartree
dipole: 0.4659 -1.4073 -1.1834
dipole: 1.8968
quadrupole: -126.5645 -133.7269 -139.3584
quadrupole: 6.4035 8.5398 -1.2618
quadrupole: 6.6521 -0.5103 -6.1418 6.4035 8.5398 -1.2618
hfenergy: -2280.4066637 hartree
pointgroup: C01 [X(C9H10Cl1N2O3P1S2)]
dipole: -0.2010265 -0.4306984 0.5753385 debye
polarizability: 309.9138862|11.8966073|161.287621|-18.1023084|-6.5402844|138.1891652 unknown
InChI: InChI=1S/C7H4ClN2O2S.C2H6OPS/c8-4-1-5-6(9-2-4)10(3-13)7(11)12-5;1-3-4(2)5/h1-2H,3H2;1-2H3
charge 0 multiplicity 1
28 atoms
Cl -5.831447 -0.16702 0.439003
S  1.992208 -1.293287 1.064979
S  4.257685 -0.92229 -1.84127
P  4.147373 -0.842893 0.234593
O  -1.029816 1.949014 -0.444674
O  4.697897 0.615793 1.001643
O  1.323262 1.862521 -0.78387
N  -0.005304 -0.114891 -0.513761
N  -2.00725 -1.50278 -0.105199
C  1.012004 -1.155584 -0.554778
C  -1.378243 -0.328744 -0.26767
C  -1.993694 0.948284 -0.237013
C  0.259339 1.262225 -0.609828
C  -3.367358 1.062594 -0.024397
C  5.155207 -2.045922 1.224561
C  -4.040022 -0.175679 0.15114
C  -3.360404 -1.414709 0.10875
C  4.420922 1.923401 0.355875
H  1.749554 -0.963442 -1.360929
H  0.503167 -2.117206 -0.710589
H  6.219056 -1.887333 0.991021
H  4.973576 -1.862839 2.295228
H  4.851046 -3.06813 0.957247
H  -3.886975 2.022319 0.006546
H  -3.899397 -2.355399 0.24751
H  3.336801 2.103633 0.278598
H  4.877098 1.956887 -0.649602
H  4.896912 2.656979 1.023084
