program: Gaussian 09
title: 000216523
version: EM64L-G09RevD.01
frameworkgroup: C1[X(C15H19ClN2)]
method: RPBEPBE
basis: SDD
operation: Freq
keyword: #p
keyword: freq=noraman
keyword: PBEPBE/SDD
title: #p freq=noraman PBEPBE/SDD
converged: YES YES NO NO
title: Mulliken charges:
elementType: Cl N N C C C C C C C C C C C C C C C H H H H H H H H H H H H H H H H H H H
charge: -0.083165 -0.189718 -0.102549 -0.474143 -0.380794 -0.516019 0.201029 -0.278102 0.348710 0.237008 0.342052 -0.776896 -0.807321 -0.286003 -0.414977 -0.810396 -0.254779 -0.240231 0.231181 0.241331 0.221255 0.245267 0.238487 0.273735 0.269565 0.214933 0.233604 0.214486 0.222366 0.223882 0.251143 0.231593 0.216182 0.226452 0.253097 0.250309 0.227425
chargesum: 0.00000
title: Mulliken charges with hydrogens summed into heavy atoms:
elementType: Cl N N C C C C C C C C C C C C C C C
charge: -0.083165 -0.189718 -0.102549 -0.001632 0.085728 -0.003797 0.201029 -0.008537 0.348710 0.237008 0.342052 -0.113872 -0.109929 -0.286003 -0.183385 -0.114665 -0.004470 -0.012806
polarizability: 3.00175989e+02 1.96633469e+00 1.70340643e+02 -6.98497321e+00 -9.10442215e+00 1.38336937e+02
1716.lowfreq: -15.0319 -11.1406 -7.2829 0.0015 0.0017 0.0024 24.9807 35.4721 44.3889
frequency: 24.6854 35.4410 44.3440 50.9536 89.4424 97.9115 112.8078 131.9482 135.6801 146.5742 185.5748 209.1843 213.9318 215.3864 246.6433 267.0881 317.5866 329.9640 335.8095 361.9764 397.3878 451.3516 476.1995 492.9944 498.6343 526.6574 542.8069 554.7785 611.5943 640.5299 663.3463 733.5654 763.2218 768.9443 811.4138 826.7291 841.3314 868.8920 880.9242 891.0223 904.1262 941.4979 954.5497 956.8867 986.7154 1000.5289 1002.3549 1040.9981 1043.1132 1069.4722 1074.0682 1079.4973 1085.0533 1127.7208 1154.6515 1174.5776 1192.1736 1198.1875 1220.6975 1227.3546 1252.3375 1276.0021 1296.0675 1302.0482 1321.4602 1351.4213 1371.1411 1388.1865 1390.8087 1396.7759 1406.5907 1422.8399 1449.1081 1452.6562 1455.9840 1456.5003 1468.4709 1472.5671 1475.5725 1476.6308 1482.8251 1498.8324 1553.5574 1599.9401 1658.8160 1696.1094 2951.9656 2960.1448 2966.5583 2973.9128 2996.3056 3019.3342 3022.0430 3023.4989 3050.3418 3060.2935 3082.5358 3086.1565 3088.3524 3098.0561 3117.3851 3126.5047 3135.4107 3149.5160 3171.1510
redmass: 4.3468 3.4617 4.0624 3.9807 3.3163 2.0743 1.0468 2.2872 1.7776 3.0098 1.3989 2.0157 2.8700 2.8774 4.3812 4.3394 3.3078 4.0689 3.1266 4.3954 3.8180 2.7473 3.8375 4.0790 4.0190 3.8366 3.1632 5.3836 3.3222 3.8849 5.3385 4.7675 1.2880 3.6828 3.9525 3.5436 3.8800 2.1078 1.4190 1.3220 1.5942 2.3933 1.3231 1.3930 1.7008 1.2683 2.2122 1.9123 1.5646 1.8125 1.7152 1.6539 1.9594 2.6126 1.2426 1.3229 1.6447 2.8209 1.2776 2.3923 2.3004 1.8510 1.5225 2.6473 1.5839 5.8401 1.9734 1.2308 1.3911 1.2697 1.4200 2.2660 1.2760 1.0744 1.4424 1.3888 1.0481 1.0570 1.1571 1.0905 1.1280 1.0902 6.5158 6.7087 11.2351 6.5209 1.0380 1.0417 1.0662 1.0378 1.0672 1.0971 1.0931 1.0651 1.0948 1.0963 1.0974 1.0975 1.1001 1.1030 1.0927 1.0875 1.0893 1.0913 1.0987
irintensity: 0.3630 0.5140 2.2462 0.4469 0.2604 0.9568 0.6078 0.1304 0.3802 3.6907 0.6968 1.6314 0.2784 0.5874 0.3039 6.4116 2.1885 1.3466 0.4241 7.3984 0.5763 8.8934 1.6634 1.4590 0.4036 0.9367 11.7702 0.8240 1.2193 8.7368 20.8510 18.8602 59.0439 6.9081 5.2306 8.2174 35.1522 1.4207 21.1069 0.0409 2.5198 8.6247 0.9214 1.8661 8.4493 7.2561 8.5521 3.5301 5.0518 36.7324 46.8862 14.7275 5.6405 10.7481 6.4204 6.0822 3.3974 73.0403 25.6831 22.7922 52.5982 4.6583 31.7393 213.9538 52.4379 9.8732 166.9057 4.4080 57.3496 14.4152 39.7232 10.4822 14.7653 9.0413 4.7104 6.2690 10.0506 25.1180 31.1488 7.3674 2.0777 4.6049 17.3799 52.9991 1036.2166 70.3894 57.1963 86.5191 75.2782 30.1841 16.9835 17.9801 49.4954 18.1014 19.4370 27.1574 31.2899 13.8419 26.7851 27.3408 24.7323 12.1008 16.5257 15.0006 19.5151
temp: 298.150 k
press: 1.00000 atm
elementType: 17 7 7 6 6 6 6 6 6 6 6 6 6 6 6 6 6 6 1 1 1 1 1 1 1 1 1 1 1 1 1 1 1 1 1 1 1
symmnumber: 1
zpe: 799597.1 jmol-1
zpe.correction: 0.304550 hartree
zpe.thermalcorrener: 0.323404 hartree
zpe.thermalcorrenthalpy: 0.324349 hartree
zpe.thermalcorrgfe: 0.255998 hartree
zpe.sumelectzpe: -1151.213020 hartree
zpe.sumelectthermal: -1151.194166 hartree
zpe.sumelectthermalent: -1151.193222 hartree
zpe.sumelectthermalfe: -1151.261573 hartree
dipole: -2.3696 -0.7942 -2.8629
dipole: 3.8003
quadrupole: -100.6405 -111.4141 -113.9300
quadrupole: 4.0590 0.0307 2.3316
quadrupole: 8.0210 -2.7526 -5.2685 4.0590 0.0307 2.3316
hfenergy: -1151.5175706 hartree
pointgroup: C01 [X(C15H19Cl1N2)]
dipole: 0.8654737 1.1400254 0.4321369 debye
polarizability: 300.3145709|1.2679664|139.8812079|5.1483932|-11.6723876|168.6577895 unknown
InChI: InChI=1S/C15H19ClN2/c1-11(2)10-18-9-5-8-14(18)17-15-12(3)6-4-7-13(15)16/h4,6-7,10H,5,8-9H2,1-3H3
charge 0 multiplicity 1
37 atoms
Cl -1.535327 -1.827189 1.882279
N  1.873995 0.455988 0.616684
N  -0.251279 -0.009316 -0.320773
C  1.291059 1.390397 2.733095
C  2.475443 1.20122 1.750233
C  0.043037 1.389441 1.816612
C  0.47426 0.541455 0.619236
C  2.55659 -0.335085 -0.335732
C  3.886417 -0.401611 -0.649151
C  -1.657196 -0.059738 -0.31447
C  -2.384585 0.634692 -1.342045
C  4.327845 -1.429829 -1.680793
C  5.021803 0.448326 -0.10267
C  -2.411828 -0.871775 0.579421
C  -3.788964 0.499721 -1.418004
C  -1.617335 1.495099 -2.325569
C  -3.809055 -1.00951 0.50224
C  -4.506114 -0.310319 -0.507173
H  1.391133 2.314276 3.326082
H  1.242814 0.535284 3.429569
H  2.875998 2.177952 1.411345
H  3.302686 0.618914 2.189826
H  -0.208247 2.409409 1.465151
H  -0.852392 0.971455 2.301469
H  1.848581 -0.973885 -0.87571
H  4.825256 -0.940619 -2.542702
H  3.479101 -2.021255 -2.064753
H  5.06554 -2.136798 -1.249044
H  5.610134 0.864338 -0.944835
H  5.727458 -0.164944 0.494409
H  4.694334 1.294562 0.517957
H  -4.327935 1.03633 -2.207706
H  -2.265258 1.826162 -3.155302
H  -1.199315 2.397041 -1.837993
H  -0.755598 0.938296 -2.73636
H  -4.335074 -1.652794 1.213685
H  -5.593983 -0.406793 -0.583803
