program: Gaussian 09
title: 000211231
version: EM64L-G09RevD.01
frameworkgroup: C1[X(C17H15I3N2O4)]
method: RPBEPBE
basis: SDD
operation: Freq
keyword: #p
keyword: freq=noraman
keyword: PBEPBE/SDD
title: #p freq=noraman PBEPBE/SDD
converged: YES YES NO NO
title: Mulliken charges:
elementType: I I I O O O O N N C C C C C C C C C C C C C C C C C H H H H H H H H H H H H H H H
charge: 0.135131 0.135627 0.117505 -0.277697 -0.419332 -0.195162 -0.205092 -0.411065 -0.677921 -0.074531 -0.412529 0.392794 0.515350 -0.686335 -0.335333 -0.380660 -0.356586 -0.423346 0.444158 0.144674 0.028487 -0.685587 -0.542912 0.827595 -0.113997 -0.575501 0.254914 0.220087 0.230901 0.225496 0.214764 0.246507 0.248287 0.252451 0.304751 0.224570 0.327434 0.271574 0.382096 0.313147 0.315289
chargesum: 0.00000
title: Mulliken charges with hydrogens summed into heavy atoms:
elementType: I I I O O O O N N C C C C C C C C C C C C C C C C C
charge: 0.135131 0.135627 0.117505 -0.277697 -0.037236 -0.195162 -0.205092 -0.083631 -0.049485 0.180383 0.038459 0.392794 0.515350 0.000433 -0.087046 -0.128209 -0.051835 -0.198777 0.444158 0.144674 0.028487 -0.685587 -0.542912 0.827595 0.157577 -0.575501
polarizability: 4.64867146e+02 -1.15003887e+01 2.83986341e+02 1.34458858e+01 -1.04387941e+00 1.79060252e+02
1716.lowfreq: -4.2329 -0.0006 -0.0003 0.0002 2.2821 2.9051 7.0694 14.6151 16.7892
frequency: 6.4250 14.5210 16.6591 26.4321 33.5270 52.9760 57.4393 66.8982 73.6565 82.7871 85.7400 88.5000 98.5610 108.0176 125.5049 135.5898 160.0705 168.7886 189.1503 205.1048 237.7408 248.7129 266.2933 271.8248 294.8810 300.8367 310.9005 350.3559 361.2771 388.4070 414.3238 418.1018 435.0700 445.7114 485.8905 498.6533 500.0831 508.3099 527.9656 548.0672 594.8795 611.2248 616.6482 641.6528 641.9175 659.0781 690.8447 698.0951 703.2220 721.2619 741.1857 756.2572 788.4942 815.6387 819.1724 831.4959 843.7634 854.7577 878.6187 910.5664 943.0968 950.0936 970.1690 975.4590 1000.8134 1003.4091 1022.3534 1048.2242 1069.3236 1093.4646 1123.2706 1133.4873 1142.1789 1183.4856 1211.1100 1222.4457 1238.5202 1258.8465 1267.2746 1275.9970 1279.1481 1310.8384 1339.9793 1343.6274 1359.5066 1365.9465 1377.9205 1400.7874 1420.7583 1436.7210 1457.1830 1474.8802 1487.2949 1496.4129 1504.3036 1517.0351 1563.0780 1595.0029 1606.6142 1626.2003 1628.1825 1679.7790 2993.9150 2995.1906 3009.7110 3059.2630 3086.9041 3105.9601 3119.7962 3152.7023 3171.0865 3180.8960 3193.7787 3512.4473 3513.2243 3519.3785 3654.0480
redmass: 11.7409 19.9904 7.0413 7.2843 8.1772 5.4751 6.0552 6.3472 8.0360 5.0597 3.7734 11.7909 15.2022 10.5616 6.5485 4.0993 110.1750 1.7929 4.4398 4.7338 4.9550 2.9421 6.7767 7.2561 5.1075 4.3371 5.5718 7.0167 5.4514 5.2917 3.1347 3.4408 3.2469 1.3781 1.3809 3.5338 3.7760 3.5822 2.5380 4.4286 1.9533 7.8948 3.2320 2.7445 1.5940 6.4751 5.0685 5.7656 8.1966 3.8622 3.8699 3.2103 3.2339 1.4780 3.3059 2.3423 1.7181 5.8673 1.3694 2.5310 1.3697 4.9957 3.2711 1.3215 2.7818 10.5849 2.4875 1.7320 1.6499 3.3241 1.3910 1.7227 2.9228 1.3485 2.2156 2.6520 1.4398 1.9485 1.3606 2.4137 1.3815 1.4407 1.3993 5.4019 1.5098 5.8438 6.3086 1.2162 4.1046 4.9353 1.0812 1.0407 1.0556 2.2731 2.5353 7.9568 4.3381 7.6029 4.8999 1.4028 5.9955 9.0889 1.0719 1.0397 1.0688 1.1015 1.1001 1.1001 1.0902 1.0900 1.0948 1.0930 1.0948 1.0456 1.0642 1.0768 1.1038
irintensity: 0.3479 0.0649 0.3409 1.0224 1.0214 2.3369 1.0625 0.6774 0.5139 1.0523 1.2360 1.7957 0.7566 1.3014 0.6301 0.9707 0.0053 0.5239 0.2140 2.7692 2.6333 0.0023 4.2098 0.9683 1.4998 8.3229 6.9050 6.0389 4.5468 1.7164 0.0191 24.0865 0.4026 1.9169 231.6371 41.2476 5.4990 8.7368 20.5480 0.6377 83.2699 31.3549 42.7036 24.4776 22.8989 43.3797 40.2064 11.0655 9.4856 0.5186 17.4149 11.6868 21.3028 18.9062 25.8481 16.0699 58.0921 9.6947 12.3249 5.6896 0.0566 58.3909 154.2424 2.0666 21.3015 31.4084 240.9938 115.7727 2.4746 34.0916 17.3217 2.0314 38.8407 131.9617 227.2317 100.0381 3.6120 6.4664 8.5990 6.5998 14.0169 24.7281 14.7956 25.9867 9.3333 13.3852 74.3532 22.3386 47.3616 194.6334 9.9531 8.5726 19.1289 28.6199 700.9958 55.5685 0.4166 56.8869 158.5967 258.9948 27.0501 172.3123 1.9860 30.0398 35.5900 9.2498 40.8828 32.6929 18.2119 16.0989 4.8720 0.0190 6.2280 66.4619 28.6256 18.3581 67.5611
temp: 298.150 k
press: 1.00000 atm
elementType: 53 53 53 8 8 8 8 7 7 6 6 6 6 6 6 6 6 6 6 6 6 6 6 6 6 6 1 1 1 1 1 1 1 1 1 1 1 1 1 1 1
symmnumber: 1
zpe: 760233.1 jmol-1
zpe.correction: 0.289558 hartree
zpe.thermalcorrener: 0.316937 hartree
zpe.thermalcorrenthalpy: 0.317882 hartree
zpe.thermalcorrgfe: 0.223506 hartree
zpe.sumelectzpe: -1099.860015 hartree
zpe.sumelectthermal: -1099.832636 hartree
zpe.sumelectthermalent: -1099.831691 hartree
zpe.sumelectthermalfe: -1099.926067 hartree
dipole: -0.0401 -0.9760 2.0394
dipole: 2.2613
quadrupole: -153.8584 -187.1599 -196.0638
quadrupole: -15.4007 13.8453 4.8695
quadrupole: 25.1690 -8.1325 -17.0365 -15.4007 13.8453 4.8695
hfenergy: -1100.149573 hartree
pointgroup: C01 [X(C17H15I3N2O4)]
dipole: -0.0908593 0.304247 0.8310672 debye
polarizability: 459.9334317|19.4117048|230.3096571|36.1161778|-50.0476628|237.6706501 unknown
InChI: InChI=1S/C17H15I3N2O4/c1-2-12(17(24)25)26-9-5-3-8(4-6-9)22-16(23)13-10(18)7-11(19)15(21)14(13)20/h3-7,12,22,24H,2,21H2,1H3
charge 0 multiplicity 1
41 atoms
I  2.872815 -2.376608 1.930238
I  3.28047 1.838652 -2.597244
I  8.219821 0.540352 0.73011
O  -4.617867 0.590121 -0.136141
O  -5.754837 -2.60779 -1.487017
O  -5.198547 -2.114076 0.719733
O  1.642084 -1.417602 -1.465932
N  1.035393 0.295301 0.032265
N  6.019061 -1.48751 2.138284
C  -5.432686 -0.286976 -0.973689
C  -6.868368 0.291781 -0.963276
C  -3.216416 0.429997 -0.16288
C  -0.386916 0.306125 -0.07115
C  -7.517452 0.339324 0.434807
C  -2.519071 -0.501424 -0.967368
C  -2.497839 1.304613 0.686352
C  -1.109611 -0.565964 -0.923242
C  -1.096708 1.241627 0.730835
C  3.392514 -0.231983 -0.251522
C  -5.419825 -1.728977 -0.442182
C  1.942814 -0.518845 -0.627692
C  4.028273 -0.949335 0.787716
C  4.156965 0.705875 -0.990524
C  5.412465 -0.777004 1.12288
C  5.521296 0.913647 -0.697015
C  6.129225 0.183328 0.337514
H  -5.052279 -0.297041 -2.014168
H  -7.479595 -0.311845 -1.66038
H  -6.800009 1.312396 -1.383701
H  -7.652572 -0.671154 0.860102
H  -8.510462 0.819373 0.376403
H  -6.89101 0.917174 1.134464
H  -3.046303 -1.192042 -1.632992
H  -3.052595 2.017544 1.302834
H  -0.567778 -1.285558 -1.539452
H  -0.549656 1.922692 1.395102
H  1.440554 0.980404 0.675981
H  6.104323 1.635347 -1.272606
H  -5.799109 -3.53921 -1.137523
H  5.49191 -2.177876 2.669908
H  7.006128 -1.346456 2.344668
