program: Gaussian 09
title: 000216532
version: EM64L-G09RevD.01
frameworkgroup: C1[X(C17H18N6O2)]
method: RPBEPBE
basis: SDD
operation: Freq
keyword: #p
keyword: freq=noraman
keyword: PBEPBE/SDD
title: #p freq=noraman PBEPBE/SDD
converged: YES YES NO NO
title: Mulliken charges:
elementType: O O N N N N N N C C C C C C C C C C C C C C C C C H H H H H H H H H H H H H H H H H H
charge: -0.268037 -0.264542 -0.097931 -0.127459 -0.028141 -0.071538 -0.396667 -0.049299 -0.348594 -0.352509 -0.395709 -0.392128 -0.495693 0.507130 0.071736 -0.484640 -0.458023 0.203906 0.157842 -0.327810 -0.088848 0.215034 -0.346480 -0.204579 -0.225433 0.229988 0.195304 0.189088 0.211426 0.260915 0.216806 0.213014 0.272774 0.220697 0.197448 0.287794 0.237371 0.248799 0.241024 0.239183 0.230649 0.312909 0.263223
chargesum: 0.00000
title: Mulliken charges with hydrogens summed into heavy atoms:
elementType: O O N N N N N N C C C C C C C C C C C C C C C C C
charge: -0.268037 -0.264542 -0.097931 -0.127459 -0.028141 -0.071538 -0.083757 -0.049299 0.076698 0.048005 0.082012 0.093660 -0.077548 0.507130 0.071736 -0.196846 -0.220652 0.203906 0.157842 -0.079011 -0.088848 0.215034 -0.105456 0.265253 0.037790
polarizability: 3.69919653e+02 2.42776810e+01 1.83715889e+02 5.18656103e+00 -3.76815181e+00 1.69335504e+02
1716.lowfreq: -10.6749 -0.0005 0.0002 0.0005 3.3758 5.2057 16.4654 25.2787 32.2010
frequency: 16.4468 25.2470 31.7658 42.9882 65.9421 83.0121 101.2540 115.6126 146.5860 163.3075 209.5107 222.2709 232.7116 250.9658 282.2481 297.7010 325.8902 337.9916 350.6464 394.6065 402.8021 422.5761 423.4302 436.8673 468.6172 500.3988 532.4318 534.6812 564.0767 577.1719 601.0353 606.8094 616.6838 631.6970 676.6493 713.2200 717.7451 722.5472 752.0820 762.5529 774.1322 779.3938 787.1011 813.5762 837.2586 838.8595 845.3831 855.3505 893.5811 899.8776 909.4915 913.3070 931.1418 938.9926 970.8833 976.2824 1000.4792 1005.0493 1052.2365 1054.8417 1057.1483 1071.1682 1080.7601 1098.1841 1118.9957 1127.6475 1133.2515 1139.2346 1141.5749 1173.0151 1181.0077 1199.7702 1206.3784 1239.2311 1246.6287 1251.2737 1262.6346 1275.1231 1281.7395 1294.9979 1309.2034 1324.9243 1328.6124 1336.0179 1342.4776 1358.8104 1363.4114 1368.5480 1379.2034 1399.8640 1409.0979 1439.6828 1444.0422 1455.3380 1460.1374 1463.1354 1464.7554 1473.0629 1477.4948 1485.2645 1516.0277 1536.2015 1602.0143 1611.7384 1629.8776 2848.4818 2855.7185 2868.5287 2969.6472 2972.5088 2985.5621 2995.5313 3029.6420 3048.2155 3102.0242 3103.5064 3106.8848 3120.5026 3133.9139 3174.3635 3179.1303 3230.9236 3591.5531
redmass: 6.0943 5.7810 5.2317 6.2079 4.7142 2.4098 6.0996 4.1694 5.0058 5.0292 6.9359 6.0032 4.5443 2.7665 2.6555 2.7356 3.9209 5.6558 5.3223 3.9233 2.1613 3.4606 3.5234 3.2196 2.9471 5.3377 5.4126 6.3085 1.7870 4.7522 5.5521 5.1254 1.7653 2.3587 9.0616 11.2201 4.8307 5.6259 5.3321 4.6800 6.0332 4.2469 8.0684 1.4832 1.4650 8.4198 1.6432 4.7390 1.5695 7.6103 1.4404 2.5116 1.4205 2.1870 3.3477 4.9429 2.4125 1.9381 1.8406 2.5255 2.9065 1.4941 1.8664 2.4387 1.8199 1.0913 3.0984 2.5489 2.4123 1.7338 2.4783 1.1537 1.6943 1.7691 4.7060 1.6583 1.9566 1.6277 1.5761 1.5062 2.0684 1.3989 3.1228 1.4640 2.0453 1.4235 1.2764 1.6881 1.7764 2.8598 2.4599 4.5702 3.0064 1.1200 1.1340 1.1169 1.1600 1.4178 1.4019 1.2789 6.4447 5.7855 7.7209 7.9514 8.2390 1.0707 1.0709 1.0692 1.0686 1.0689 1.0868 1.0609 1.0895 1.0892 1.0937 1.1102 1.0931 1.0930 1.0898 1.0927 1.0953 1.0985 1.0821
irintensity: 0.2156 1.2220 0.4038 1.9970 2.4955 14.2434 12.4102 3.4805 1.1153 1.8337 0.0552 0.1631 4.6760 5.8899 0.1226 5.5439 1.6803 3.2055 11.1656 7.2819 0.1585 5.1788 6.6526 0.5775 1.8582 0.9811 7.0859 4.2908 115.1300 2.8421 0.9495 4.1799 18.2127 3.8122 0.7327 1.5620 1.4855 4.0351 8.7462 16.4310 5.8322 20.2862 2.5697 44.0442 24.0080 32.6605 0.4499 15.5651 19.7937 0.9991 14.6299 11.5711 2.4210 0.0324 68.3656 133.6075 104.8268 13.6879 0.5979 7.9573 17.7784 6.8807 10.4719 7.6604 54.9973 9.4371 30.3810 12.1282 10.7430 20.5290 21.0655 7.5779 15.2425 110.9748 231.9253 42.3603 12.2208 26.7155 5.4937 51.3259 2.3040 83.9909 107.0398 48.9988 80.5477 13.7307 1.6549 4.3246 10.8543 89.8739 6.9256 57.6179 3.1663 26.6183 73.2079 9.2637 60.5812 70.5700 23.6870 26.1403 35.1139 718.0576 290.6273 4.0298 0.2574 38.0688 40.8331 162.9633 15.6708 112.7396 20.6963 139.2807 55.8947 36.1855 5.3970 31.9184 5.7222 25.3918 10.4588 1.9595 6.7840 1.6847 55.8499
temp: 298.150 k
press: 1.00000 atm
elementType: 8 8 7 7 7 7 7 7 6 6 6 6 6 6 6 6 6 6 6 6 6 6 6 6 6 1 1 1 1 1 1 1 1 1 1 1 1 1 1 1 1 1 1
symmnumber: 1
zpe: 887110.8 jmol-1
zpe.correction: 0.337883 hartree
zpe.thermalcorrener: 0.358165 hartree
zpe.thermalcorrenthalpy: 0.359109 hartree
zpe.thermalcorrgfe: 0.286423 hartree
zpe.sumelectzpe: -1135.722142 hartree
zpe.sumelectthermal: -1135.701860 hartree
zpe.sumelectthermalent: -1135.700916 hartree
zpe.sumelectthermalfe: -1135.773602 hartree
dipole: 1.7477 -2.2274 2.5317
dipole: 3.7980
quadrupole: -104.9740 -141.6264 -144.4734
quadrupole: -21.2887 21.1232 1.8316
quadrupole: 25.3839 -11.2684 -14.1155 -21.2887 21.1232 1.8316
hfenergy: -1136.0600246 hartree
pointgroup: C01 [X(C17H18N6O2)]
dipole: 0.6927593 0.8143148 -1.0439233 debye
polarizability: 369.345671|-26.5226232|183.8162902|-4.6095774|-4.3833187|169.8090849 unknown
InChI: InChI=1S/C17H18N6O2/c1-2-14-15(25-11-24-14)7-12(1)9-22-3-5-23(6-4-22)17-18-8-13-16(21-17)20-10-19-13/h1-2,7-8,10,19H,3-6,9,11H2
charge 0 multiplicity 1
43 atoms
O  -5.510818 1.394222 1.498261
O  -6.970869 1.088291 -0.381015
N  -0.940755 -1.077746 0.255928
N  1.683747 0.05012 0.473987
N  3.953836 -0.55952 0.678108
N  3.255664 1.381735 -0.683754
N  6.97762 0.788976 -0.634291
N  6.394218 -0.969627 0.721455
C  -0.500551 -0.010684 -0.678589
C  0.207201 -1.919285 0.677929
C  0.568246 0.879458 -0.016018
C  1.284153 -1.055578 1.362863
C  -2.068636 -1.877638 -0.277404
C  -3.369142 -1.084678 -0.370511
C  3.005663 0.291056 0.151142
C  -3.730532 -0.206138 0.694569
C  -4.233982 -1.252969 -1.47859
C  -4.955071 0.450906 0.592208
C  -5.817039 0.271127 -0.512749
C  -5.482603 -0.574499 -1.570866
C  5.230376 -0.270051 0.330091
C  5.579258 0.837792 -0.522549
C  4.541335 1.650741 -1.016857
C  -6.881956 1.657844 0.989674
C  7.399727 -0.304861 0.126562
H  -1.37517 0.607749 -0.94803
H  -0.082436 -0.446741 -1.621755
H  0.670577 -2.452642 -0.190885
H  -0.15496 -2.682105 1.392584
H  0.968768 1.617394 -0.726633
H  0.108691 1.415159 0.840122
H  0.865313 -0.634963 2.300293
H  2.179728 -1.648179 1.602642
H  -2.209521 -2.732844 0.414468
H  -1.837602 -2.316673 -1.281522
H  -3.049321 -0.057606 1.536381
H  -3.937032 -1.924771 -2.292166
H  -6.144716 -0.702063 -2.430959
H  4.70835 2.51256 -1.673901
H  -7.042596 2.745757 0.936633
H  -7.613622 1.143509 1.641638
H  7.573582 1.423419 -1.163182
H  8.450575 -0.574851 0.215389
