program: Gaussian 09
title: 000211225
version: EM64L-G09RevD.01
frameworkgroup: C1[X(C17H19NO4S)]
method: RPBEPBE
basis: SDD
operation: Freq
keyword: #p
keyword: freq=noraman
keyword: PBEPBE/SDD
title: #p freq=noraman PBEPBE/SDD
converged: YES YES NO NO
title: Mulliken charges:
elementType: S O O O O N C C C C C C C C C C C C C C C C C H H H H H H H H H H H H H H H H H H H
charge: 0.174856 -0.308817 -0.300960 -0.289670 -0.263753 -0.480302 0.366912 0.048137 0.291344 0.234478 -0.552571 -0.508941 0.116823 0.502439 -0.337352 -0.446781 -0.231889 -0.194967 -0.218428 -0.524637 -0.526738 -0.523196 -0.840148 0.297959 0.234186 0.317278 0.311905 0.221604 0.247909 0.254294 0.260484 0.235012 0.229722 0.233775 0.225964 0.250010 0.232037 0.264486 0.214447 0.264055 0.253514 0.265520
chargesum: 0.00000
title: Mulliken charges with hydrogens summed into heavy atoms:
elementType: S O O O O N C C C C C C C C C C C C C C C C C
charge: 0.174856 -0.308817 -0.300960 -0.289670 -0.263753 -0.163024 0.366912 0.048137 0.291344 0.234478 -0.254612 -0.274755 0.116823 0.502439 -0.025447 -0.225176 -0.231889 0.052942 0.035866 0.200582 0.183010 0.187774 -0.057059
polarizability: 4.15072654e+02 -4.56707884e+00 2.17100233e+02 -4.84888554e+00 -8.07732349e+00 1.30552195e+02
1716.lowfreq: -10.9768 -4.0482 -0.0008 0.0003 0.0008 3.0473 16.8733 21.6373 28.4500
frequency: 16.2936 21.5158 28.4172 41.9157 57.6956 59.6909 70.8076 77.8496 95.1744 104.4610 123.8442 125.6767 137.2715 153.6051 156.9749 158.3064 174.5224 196.1951 209.2493 229.1623 248.7202 265.5489 286.0451 320.2057 329.2425 363.4272 368.7985 378.0948 409.3701 413.3434 428.6746 507.8071 519.6469 525.1658 575.3891 589.0754 622.3194 630.1806 638.7384 642.8527 658.4499 685.2277 721.4135 740.4757 773.3460 778.3232 827.9998 836.5126 862.0802 863.5591 874.2361 898.7683 924.6398 938.0027 950.6661 961.9497 986.2081 989.5521 991.9147 997.2334 1037.5875 1073.3906 1081.6021 1110.1270 1111.7553 1113.7515 1114.1179 1145.0290 1151.2722 1158.1734 1164.3663 1185.3156 1198.1990 1221.8958 1262.7121 1291.2706 1301.3328 1338.5522 1354.7302 1360.7429 1391.7813 1401.4691 1416.3505 1434.4217 1436.5984 1444.2538 1452.1637 1457.9723 1458.4838 1459.7380 1462.7871 1475.8601 1479.4794 1483.1898 1485.5928 1500.6451 1559.9170 1584.0461 1600.6043 1604.6200 1606.8194 2975.5224 2976.7580 2982.7424 3008.7636 3073.7473 3084.3484 3085.3854 3111.8103 3124.8271 3126.6936 3129.8244 3132.3579 3133.5225 3139.3661 3144.3183 3159.0323 3177.1819 3195.9787 3534.2477
redmass: 4.6973 3.9452 4.0925 4.1917 4.0569 2.4147 4.7827 3.2484 2.8861 3.0238 1.5841 2.3658 1.5775 1.6895 1.4440 1.2478 3.8856 4.0411 3.7449 5.0254 5.3633 6.9951 5.5005 4.3504 7.0307 5.5180 5.3532 6.6162 4.5545 4.2957 6.4895 5.4573 5.2181 2.9732 4.8991 4.5307 6.4266 5.9065 1.4001 5.9548 4.5581 5.9610 3.5875 4.3617 4.5301 6.7303 1.4326 4.7535 1.4131 2.9138 2.8205 8.0870 1.5431 9.1356 1.3489 1.1737 1.2790 7.2507 1.3279 3.9914 6.3293 2.6213 2.2926 1.2439 1.2371 1.2533 1.3559 1.6355 1.3870 1.4765 2.9156 1.1149 1.9221 1.6751 1.9070 1.5383 4.5614 1.1322 4.9944 6.4030 3.0413 4.0570 1.3099 1.2624 1.4086 1.0580 1.4065 1.0848 1.1705 1.0556 1.3375 1.0673 2.4035 1.0579 1.0579 2.5072 7.5548 6.0296 6.4609 4.4156 6.8287 1.0312 1.0335 1.0295 1.0278 1.1039 1.0997 1.1047 1.0896 1.1028 1.1037 1.1046 1.1055 1.1042 1.0910 1.0911 1.0950 1.0922 1.0947 1.0757
irintensity: 1.7182 2.2539 1.2342 0.7217 3.1524 2.0784 0.4596 3.2165 5.8466 8.2542 0.9984 1.0478 1.3289 4.7027 4.7144 1.7241 1.2545 2.5076 5.6849 5.6486 11.0764 0.1347 18.6291 4.2712 0.1298 3.7650 2.4253 0.9082 5.7853 9.1457 3.6323 5.7187 6.2452 29.0270 4.2233 8.8177 5.4803 7.5960 32.2239 5.2534 6.2435 16.1595 0.6022 30.7501 8.9119 16.9472 40.2712 0.4674 50.9973 10.5317 15.1211 40.4003 20.1755 78.4335 0.2878 8.6538 30.3778 94.3912 3.1102 17.6619 175.2374 8.8588 10.8378 21.3681 6.0220 5.5852 15.4276 17.4480 5.7226 17.8313 58.6213 5.0870 7.2685 11.7198 75.2827 8.9846 386.8726 0.3071 257.6150 45.8883 32.7536 41.8805 7.6124 34.7930 21.4756 20.0443 84.8608 28.1788 14.6589 9.5703 36.8687 6.3563 79.7433 29.7175 55.6148 505.3920 182.0325 57.5223 11.7193 30.2397 45.2936 52.4790 108.9143 65.2124 36.5349 26.0108 25.9917 24.5961 19.5719 22.4129 23.1986 13.7791 17.8609 15.4113 6.8566 7.1715 5.5942 4.1662 7.4771 10.6740
temp: 298.150 k
press: 1.00000 atm
elementType: 16 8 8 8 8 7 6 6 6 6 6 6 6 6 6 6 6 6 6 6 6 6 6 1 1 1 1 1 1 1 1 1 1 1 1 1 1 1 1 1 1 1
symmnumber: 1
zpe: 854319.0 jmol-1
zpe.correction: 0.325393 hartree
zpe.thermalcorrener: 0.350044 hartree
zpe.thermalcorrenthalpy: 0.350988 hartree
zpe.thermalcorrgfe: 0.267624 hartree
zpe.sumelectzpe: -1411.180818 hartree
zpe.sumelectthermal: -1411.156167 hartree
zpe.sumelectthermalent: -1411.155223 hartree
zpe.sumelectthermalfe: -1411.238587 hartree
dipole: 4.6376 3.1613 -0.4143
dipole: 5.6279
quadrupole: -118.8875 -140.9538 -141.1808
quadrupole: -1.1272 -15.2556 -1.3625
quadrupole: 14.7865 -7.2798 -7.5068 -1.1272 -15.2556 -1.3625
hfenergy: -1411.5062111 hartree
pointgroup: C01 [X(C17H19N1O4S1)]
dipole: 1.788525 -1.2783156 0.2638764 debye
polarizability: 414.8811518|0.1751575|215.9387799|10.2780928|-12.5436428|131.9051505 unknown
InChI: InChI=1S/C17H19NO4S/c1-20-14-9-11(10-15(21-2)16(14)22-3)17(19)18-12-5-7-13(23-4)8-6-12/h5-10,18H,1-4H3
charge 0 multiplicity 1
42 atoms
S  -7.511269 0.065113 0.306438
O  5.101454 -0.69093 -0.002835
O  4.283158 2.078451 0.117929
O  3.032247 -2.713742 -0.122869
O  -0.759119 2.017358 -0.427375
N  -1.408536 -0.13448 0.25015
C  0.978236 0.372917 -0.025027
C  3.736645 -0.329408 0.033124
C  3.32991 1.036679 0.093573
C  2.738974 -1.34569 0.000144
C  1.968314 1.382315 0.043238
C  1.372119 -0.988762 -0.033517
C  -0.457374 0.829582 -0.094169
C  -2.825962 -0.028405 0.232584
C  -3.516736 1.152797 -0.155988
C  -3.569324 -1.173216 0.631416
C  -5.667128 0.024934 0.244417
C  -4.926661 1.167791 -0.138123
C  -4.977688 -1.148257 0.632446
C  5.803806 -0.273557 -1.245612
C  5.158995 2.101736 1.313779
C  3.986309 -3.299084 0.84683
C  -7.895919 0.068064 -1.548133
H  1.670413 2.434242 0.051097
H  0.660426 -1.816036 -0.132295
H  -1.046007 -1.02868 0.586831
H  -2.945197 2.03545 -0.446838
H  -3.045448 -2.08927 0.934522
H  -5.455716 2.087227 -0.41188
H  -5.544389 -2.035673 0.93137
H  5.740729 0.821098 -1.374646
H  5.359898 -0.789204 -2.116313
H  6.849241 -0.588907 -1.109431
H  5.847178 2.944902 1.152057
H  4.552769 2.279971 2.22174
H  5.720218 1.155426 1.412665
H  4.063552 -4.359009 0.561405
H  4.967628 -2.802358 0.783103
H  3.582053 -3.214538 1.873972
H  -7.421555 0.936756 -2.029329
H  -8.991417 0.144344 -1.635176
H  -7.542832 -0.867145 -2.008175
