program: Gaussian 09
title: 000211223
version: EM64L-G09RevD.01
frameworkgroup: C1[X(C11H18N2O2)]
method: RPBEPBE
basis: SDD
operation: Freq
keyword: #p
keyword: freq=noraman
keyword: PBEPBE/SDD
title: #p freq=noraman PBEPBE/SDD
converged: NO YES NO NO
title: Mulliken charges:
elementType: O O N N C C C C C C C C C C C H H H H H H H H H H H H H H H H H H
charge: -0.284854 -0.204472 -0.088818 -0.583162 0.360549 0.183459 -0.519285 -0.028118 -0.472903 -0.489886 -0.743284 -0.752406 -0.751363 -0.013819 0.204391 0.244697 0.220203 0.230206 0.201774 0.194764 0.231130 0.223343 0.204362 0.205958 0.239960 0.213247 0.215046 0.213507 0.217794 0.216713 0.211419 0.344102 0.355745
chargesum: 0.00000
title: Mulliken charges with hydrogens summed into heavy atoms:
elementType: O O N N C C C C C C C C C C C
charge: -0.284854 -0.204472 -0.088818 0.116685 0.360549 0.183459 -0.054385 0.202089 -0.076365 -0.035412 -0.093004 -0.110606 -0.105437 -0.013819 0.204391
polarizability: 1.50804368e+02 3.70659198e+00 1.19416144e+02 8.69401812e+00 7.44809625e+00 1.35623914e+02
1716.lowfreq: -10.9323 -0.0005 -0.0003 0.0008 7.5881 13.7205 53.2516 84.5506 113.0689
frequency: 53.2489 84.5069 113.0652 143.0676 155.3053 180.2405 204.4141 215.7170 223.9736 246.2211 261.5186 274.2523 295.1938 326.1654 343.5668 358.6993 399.4079 418.5930 445.2091 478.0721 480.0921 507.4380 528.5222 581.0090 614.6756 660.6888 678.6025 707.7300 759.1933 768.0123 836.0493 853.0640 856.7480 878.2330 899.2547 917.6573 932.3846 936.9880 960.3823 983.7066 1005.9264 1016.1651 1053.2373 1067.3390 1093.7957 1102.4405 1141.7923 1166.3171 1183.3313 1192.1577 1216.2952 1252.2496 1279.4895 1283.8471 1296.6159 1304.1564 1337.4954 1343.2325 1355.5694 1366.3463 1376.8670 1386.0438 1395.1218 1438.2467 1445.3025 1456.1707 1465.8025 1471.8159 1475.2068 1476.9339 1481.1168 1491.7763 1562.4234 1618.0583 1697.9028 2948.0051 2966.9959 2968.7811 2974.0079 2975.4882 2979.4947 2983.8986 3015.6037 3035.8850 3043.7198 3061.7773 3064.2504 3066.4223 3068.0991 3069.4866 3097.4210 3559.4885 3711.2928
redmass: 4.4234 3.7878 4.8001 2.5667 3.7961 4.5136 1.1101 1.1232 2.1821 1.7381 2.9157 1.6522 2.4891 2.5365 3.2508 3.2067 2.0887 2.2443 1.9057 2.2966 1.2268 3.0737 1.1969 4.5719 8.8303 5.2411 7.9221 7.9634 5.8288 3.6481 2.5495 2.0211 1.7703 4.5846 2.4320 1.9441 2.1046 1.4647 1.6881 1.6121 1.5052 2.0110 1.9143 2.2037 2.4746 1.4416 4.2139 2.4000 2.3820 2.6906 2.5964 1.9775 1.6779 1.3007 1.3015 1.6702 1.4983 1.6493 1.6278 2.8450 1.2323 1.2149 1.2144 1.0813 1.0832 1.0789 1.0529 1.0598 1.0464 1.0574 1.0593 1.0586 1.8269 2.5609 8.6548 1.0615 1.0357 1.0360 1.0580 1.0670 1.0436 1.0695 1.0998 1.1006 1.1013 1.0995 1.0992 1.0992 1.0989 1.0990 1.0973 1.0449 1.1058
irintensity: 3.1275 2.3411 0.8381 0.7022 1.4804 6.4849 0.1008 0.3174 1.4524 2.5894 1.7781 1.0171 1.3106 1.7202 0.5586 1.1441 0.0582 1.7602 2.1554 24.8359 59.6519 15.9629 196.0225 0.0388 0.2015 9.0662 12.3248 15.1019 8.3708 3.1083 0.5627 5.4239 4.3845 68.7883 17.2622 12.1245 7.9237 2.1995 1.3712 5.7436 6.4486 40.1403 20.3657 11.9970 7.0002 0.6300 61.0781 16.9140 45.5011 23.6937 14.5455 39.0989 7.3555 0.8811 8.2849 8.3731 11.0202 10.4516 6.2398 185.3566 25.2266 7.1413 12.9159 9.3836 7.3207 3.4539 1.3578 7.3923 17.7450 10.7306 8.7373 15.6679 188.7358 769.0340 61.8624 27.6877 34.7049 39.9307 18.2203 12.0498 30.6194 19.0229 35.5281 13.3668 14.1681 1.2480 40.1930 57.1140 42.3241 76.8561 28.6576 132.1941 64.3243
temp: 298.150 k
press: 1.00000 atm
elementType: 8 8 7 7 6 6 6 6 6 6 6 6 6 6 6 1 1 1 1 1 1 1 1 1 1 1 1 1 1 1 1 1 1
symmnumber: 1
zpe: 732399.1 jmol-1
zpe.correction: 0.278956 hartree
zpe.thermalcorrener: 0.294160 hartree
zpe.thermalcorrenthalpy: 0.295104 hartree
zpe.thermalcorrgfe: 0.238272 hartree
zpe.sumelectzpe: -688.774158 hartree
zpe.sumelectthermal: -688.758954 hartree
zpe.sumelectthermalent: -688.758010 hartree
zpe.sumelectthermalfe: -688.814842 hartree
dipole: 1.0752 -1.5012 -5.6258
dipole: 5.9211
quadrupole: -86.4466 -89.7560 -95.4862
quadrupole: 5.9047 19.3013 -1.1072
quadrupole: 4.1163 0.8069 -4.9232 5.9047 19.3013 -1.1072
hfenergy: -689.0531145 hartree
pointgroup: C01 [X(C11H18N2O2)]
dipole: 0.5142437 -0.6924763 -2.1639566 debye
polarizability: 150.0368088|4.180732|120.2851304|8.9797418|8.470157|135.5224867 unknown
InChI: InChI=1S/C11H18N2O2/c1-7-4-10(2,3)6-11(5-7)8(14)13-9(12)15-11/h7H,4-6,12H2,1-3H3
charge 0 multiplicity 1
33 atoms
O  -1.061253 -0.329784 -1.033009
O  -1.701719 0.778806 2.342254
N  -2.889939 0.036907 0.39943
N  -3.208563 -0.753383 -1.841665
C  1.843746 -1.097765 0.189979
C  -0.457088 0.163073 0.274897
C  0.456796 -0.92041 0.877085
C  1.605357 1.323446 -0.745518
C  2.500865 0.302177 -0.001898
C  0.267133 1.494176 0.01111
C  1.705949 -1.832224 -1.171116
C  2.737306 -1.953409 1.12485
C  2.315426 2.685223 -0.898922
C  -1.736925 0.374658 1.157116
C  -2.442014 -0.343026 -0.797892
H  0.610267 -0.616778 1.93303
H  -0.08493 -1.885928 0.898752
H  1.383236 0.931184 -1.758867
H  3.460459 0.182117 -0.543843
H  2.75067 0.719908 0.997493
H  0.458235 1.951952 1.003332
H  -0.410006 2.177686 -0.535844
H  2.698235 -1.94838 -1.64649
H  1.281241 -2.84321 -1.024034
H  1.044002 -1.29441 -1.869191
H  3.736043 -2.110907 0.676031
H  2.879029 -1.461235 2.105389
H  2.28789 -2.948244 1.305366
H  3.263915 2.578844 -1.457125
H  1.682494 3.412164 -1.441226
H  2.553656 3.118968 0.091348
H  -2.777607 -1.028002 -2.720783
H  -4.217812 -0.78249 -1.723245
