program: Gaussian 09
title: 000211219
version: EM64L-G09RevD.01
frameworkgroup: C1[X(C11H14N4O2)]
method: RPBEPBE
basis: SDD
operation: Freq
keyword: #p
keyword: freq=noraman
keyword: PBEPBE/SDD
title: #p freq=noraman PBEPBE/SDD
converged: YES YES NO NO
title: Mulliken charges:
elementType: O O N N N N C C C C C C C C C C C H H H H H H H H H H H H H H
charge: -0.206989 -0.254401 -0.257929 -0.076993 -0.039886 -0.070003 0.350719 0.223024 0.203104 -0.545511 -0.427420 -0.756735 0.200406 0.008807 -0.744989 -0.513292 -0.508303 0.264493 0.306355 0.244489 0.226467 0.244493 0.250817 0.234655 0.234659 0.226917 0.249844 0.226942 0.230191 0.238029 0.238037
chargesum: 0.00000
title: Mulliken charges with hydrogens summed into heavy atoms:
elementType: O O N N N N C C C C C C C C C C C
charge: -0.206989 -0.254401 -0.257929 -0.076993 -0.039886 -0.070003 0.350719 0.223024 0.203104 -0.281018 -0.121065 -0.041285 0.200406 0.008807 -0.024859 0.190411 0.197954
polarizability: 2.35934558e+02 -1.41243966e+00 1.80080734e+02 1.35122051e-02 3.28467304e-03 8.11523356e+01
1716.lowfreq: -98.9222 0.0006 0.0007 0.0009 1.6037 5.0691 8.5851 19.5249 56.6273
frequency: -98.9196 19.3593 56.6254 64.2836 93.3295 100.5570 120.2933 131.7851 170.1885 173.0899 190.9950 198.4524 222.6433 226.1856 237.5572 251.2903 285.2718 358.6245 394.3751 401.9845 466.5457 547.5748 572.2155 585.1860 597.5082 631.9813 632.8919 664.7318 677.9039 723.8782 761.0439 779.9035 824.8019 893.2633 912.4515 936.8040 951.9502 972.6610 983.0924 1011.8474 1026.9880 1044.5248 1050.6942 1069.4325 1111.3853 1113.2420 1114.2440 1147.8071 1151.7162 1165.2707 1198.2102 1282.7268 1316.0868 1346.5720 1370.7551 1394.3039 1399.6543 1404.8616 1414.1409 1431.1528 1447.9687 1450.9208 1459.3990 1460.2806 1462.5777 1464.1800 1464.4655 1469.0996 1479.6610 1490.7336 1526.5841 1551.5385 1555.1527 2971.4161 2994.1956 2997.4002 3002.1600 3064.8830 3077.7027 3078.4745 3102.8806 3104.1329 3133.8069 3140.5233 3141.3530 3227.9607 3239.4608
redmass: 1.0253 4.3534 1.1335 2.7300 4.3714 3.2391 1.2706 2.8623 3.5168 1.6541 3.4087 2.9859 3.5116 6.6337 2.1044 3.7021 4.5075 3.1784 6.5239 4.5215 5.3464 5.6874 5.3582 5.1291 3.5550 6.6387 4.2825 3.6783 7.9187 5.6531 3.8990 1.4394 5.9932 1.5152 7.6843 7.2618 6.1577 2.2028 2.4779 2.5552 3.5629 1.4951 1.6061 2.0407 1.2531 1.2522 4.2950 1.2812 1.5638 1.6450 3.4302 8.4709 5.8803 3.2419 2.1367 2.4928 1.4289 1.9338 1.4570 1.9251 1.0518 2.1392 1.0475 1.1379 1.0498 1.0444 1.0738 1.0891 3.5234 1.4601 8.8120 6.3555 6.3343 1.0320 1.0370 1.0377 1.0291 1.1046 1.0982 1.0969 1.0993 1.1044 1.0996 1.1009 1.1049 1.0940 1.0984
irintensity: 0.4346 1.1509 2.5032 5.1211 2.9735 0.7573 0.2996 1.3326 0.2209 0.0083 6.5220 4.1272 6.4310 3.1403 1.9550 0.0653 1.2778 24.1433 3.1767 0.6333 0.1240 0.5200 17.8902 10.1128 0.0017 0.4786 0.1477 0.7169 1.7761 24.0165 0.0038 47.9159 9.6527 38.4841 19.1372 4.7849 19.2103 41.6138 27.1333 44.7418 107.7168 8.2170 6.0703 12.2483 0.1663 0.0771 3.8090 1.1310 16.4232 108.8052 21.0511 56.5364 292.5117 31.5204 26.6974 196.2923 79.0422 20.2007 9.0707 68.9724 12.5937 10.4916 11.6843 94.8416 25.2262 8.7500 8.9226 32.2045 101.2524 4.0185 95.8946 606.3870 582.2938 64.0235 29.7472 10.6646 54.4985 39.4335 15.0612 15.0936 18.0084 29.3202 10.2785 14.2568 23.8556 3.6716 2.9512
temp: 298.150 k
press: 1.00000 atm
elementType: 8 8 7 7 7 7 6 6 6 6 6 6 6 6 6 6 6 1 1 1 1 1 1 1 1 1 1 1 1 1 1
symmnumber: 1
zpe: 633648.8 jmol-1
zpe.correction: 0.241344 hartree
zpe.thermalcorrener: 0.257919 hartree
zpe.thermalcorrenthalpy: 0.258863 hartree
zpe.thermalcorrgfe: 0.196014 hartree
zpe.sumelectzpe: -795.723405 hartree
zpe.sumelectthermal: -795.706831 hartree
zpe.sumelectthermalent: -795.705887 hartree
zpe.sumelectthermalfe: -795.768735 hartree
dipole: 2.0485 1.5384 -0.0051
dipole: 2.5618
quadrupole: -70.8680 -93.9507 -101.1587
quadrupole: 5.1771 -0.0092 -0.0132
quadrupole: 17.7911 -5.2916 -12.4995 5.1771 -0.0092 -0.0132
hfenergy: -795.9647494 hartree
pointgroup: C01 [X(C11H14N4O2)]
dipole: -0.7881197 0.628252 0.0054089 debye
polarizability: 235.9683699|-0.1997386|180.045432|-0.4252014|0.179613|81.1538264 unknown
InChI: InChI=1S/C11H14N4O2/c1-7-5-11(17-4)15(14-7)9-6-10(16-3)13-8(2)12-9/h5-6H,1-4H3
charge 0 multiplicity 1
31 atoms
O  -2.022134 2.031819 0.010435
O  3.415476 -1.840299 -0.011832
N  -1.13021 -0.221844 0.000744
N  -1.586993 -1.565339 -0.001494
N  0.706335 1.296114 -0.003588
N  2.996583 0.490385 -0.009665
C  -2.211046 0.67115 0.006774
C  0.270811 -0.001987 -0.002703
C  -2.941422 -1.468637 0.003028
C  -3.381788 -0.102973 0.008557
C  1.14595 -1.107186 -0.005412
C  -3.792359 -2.71042 0.001662
C  2.523717 -0.7851 -0.008978
C  2.054254 1.488728 -0.006927
C  2.560197 2.909438 -0.007315
C  -3.269962 2.816908 0.016952
C  4.855078 -1.499336 -0.015676
H  -4.409013 0.251351 0.012958
H  0.781728 -2.132527 -0.004945
H  -3.593689 -3.325845 -0.893818
H  -4.863317 -2.449453 0.011357
H  -3.580074 -3.337001 0.886159
H  1.711736 3.608831 -0.007202
H  3.191803 3.092041 0.880579
H  3.192025 3.091704 -0.895033
H  -3.864236 2.597689 0.924104
H  -2.943581 3.866138 0.01925
H  -3.869983 2.603447 -0.887772
H  5.362517 -2.474877 -0.017727
H  5.117985 -0.914085 0.881441
H  5.11291 -0.912936 -0.913512
