program: Gaussian 09
title: 000211217
version: EM64L-G09RevD.01
frameworkgroup: C1[X(C9H14N4O3)]
method: RPBEPBE
basis: SDD
operation: Freq
keyword: #p
keyword: freq=noraman
keyword: PBEPBE/SDD
title: #p freq=noraman PBEPBE/SDD
converged: YES YES NO NO
title: Mulliken charges:
elementType: O O O N N N N C C C C C C C C C H H H H H H H H H H H H H H
charge: -0.288587 -0.165896 -0.240956 -0.122248 -0.132603 -0.027607 0.077929 -0.371545 -0.391291 -0.519814 0.263748 0.176476 -0.141533 -0.294502 -0.617236 -0.630694 0.248786 0.249943 0.258872 0.208538 0.248380 0.221348 0.270167 0.265859 0.223415 0.284667 0.223332 0.230719 0.253591 0.238741
chargesum: 0.00000
title: Mulliken charges with hydrogens summed into heavy atoms:
elementType: O O O N N N N C C C C C C C C C
charge: -0.288587 -0.165896 -0.240956 -0.122248 -0.132603 -0.027607 0.077929 0.127184 0.076120 -0.050086 0.263748 0.176476 0.128634 -0.028643 0.114178 0.092357
polarizability: 1.75901594e+02 1.24108915e+01 1.46918790e+02 1.73281335e+01 -2.16547349e+00 9.74606410e+01
1716.lowfreq: -8.0489 -7.5342 -5.4016 -0.0010 -0.0010 -0.0010 9.6409 18.9582 38.4480
frequency: 6.8449 18.9277 38.4255 43.0007 56.3756 82.2292 102.7462 131.0080 146.1470 161.6029 180.0719 235.9461 243.2480 250.7695 298.7714 346.3499 379.2001 395.8001 431.8874 487.2307 531.0803 559.3884 587.0756 623.7176 630.4969 699.5921 712.5459 750.5387 759.3705 773.9440 791.0474 861.4176 863.2100 888.4874 953.0371 1038.3391 1048.6031 1052.4545 1073.0935 1073.6598 1091.4350 1107.5586 1137.2825 1141.4037 1144.7679 1153.0314 1230.0530 1241.2478 1247.1606 1251.2835 1292.9819 1299.0787 1334.8005 1339.5620 1358.0860 1364.1890 1369.1804 1390.1908 1409.0269 1415.3056 1442.9076 1449.3859 1451.3697 1471.2068 1473.4830 1477.9748 1483.8963 1488.3874 1503.7354 1592.0539 2959.7175 2960.8936 2969.9801 3016.8070 3027.9836 3028.4168 3035.1925 3044.0234 3084.4986 3107.3909 3120.1583 3124.3830 3228.1273 3253.3605
redmass: 3.0753 5.5243 7.9890 1.7343 3.4254 3.4726 2.7481 1.5790 1.9179 2.0622 4.7416 4.9036 2.9383 6.5989 3.6127 3.0849 3.9474 3.2035 6.9575 3.6661 4.7116 3.1567 4.6898 6.3807 3.8682 10.3880 4.8660 1.3456 5.0948 1.3273 4.8514 1.4774 1.5946 4.7695 3.1190 2.5506 2.5765 1.5979 2.7273 1.4700 1.2274 2.2547 1.9070 1.5795 2.9462 1.6962 3.3229 4.3884 1.7868 1.3703 1.3294 2.2638 1.5543 4.0560 5.2074 1.8778 2.4320 2.7040 1.1836 2.6783 1.1487 1.6556 1.3155 1.1950 1.0537 1.1027 1.3355 1.0467 1.2008 6.3757 1.0623 1.0411 1.0366 1.0637 1.0906 1.0661 1.0981 1.1018 1.1001 1.1030 1.0972 1.0946 1.0925 1.1080
irintensity: 4.1653 3.5618 1.3038 1.4203 0.1322 0.7565 0.4491 1.1039 2.0197 2.4453 0.1263 2.5403 9.2118 1.2311 1.2344 3.0681 24.0857 1.7597 0.8533 3.5583 2.2532 2.3612 7.6454 16.8929 1.2941 2.7849 10.2724 19.7095 12.8263 52.3607 3.6352 6.9991 7.1623 3.1091 5.0979 28.6129 17.1723 7.1291 16.9441 0.5290 0.7031 22.3568 74.7024 49.4898 89.7022 10.2385 45.1401 13.0451 16.4265 30.7983 22.0965 103.7148 4.8177 113.1870 237.3446 2.8555 12.7872 85.9275 47.9709 3.0251 7.8815 5.5248 14.1127 9.2139 8.6304 16.3639 12.9894 27.5679 22.0555 263.6535 30.5877 37.1494 93.5037 17.8602 14.6657 19.2672 39.1749 31.5087 6.1455 9.6713 1.7721 19.0008 1.5628 1.4198
temp: 298.150 k
press: 1.00000 atm
elementType: 8 8 8 7 7 7 7 6 6 6 6 6 6 6 6 6 1 1 1 1 1 1 1 1 1 1 1 1 1 1
symmnumber: 1
zpe: 618592.8 jmol-1
zpe.correction: 0.235610 hartree
zpe.thermalcorrener: 0.252400 hartree
zpe.thermalcorrenthalpy: 0.253344 hartree
zpe.thermalcorrgfe: 0.186378 hartree
zpe.sumelectzpe: -794.711714 hartree
zpe.sumelectthermal: -794.694924 hartree
zpe.sumelectthermalent: -794.693979 hartree
zpe.sumelectthermalfe: -794.760945 hartree
dipole: 5.7414 -3.0359 5.3110
dipole: 8.3897
quadrupole: -94.8372 -97.5527 -95.4693
quadrupole: 22.4857 1.0775 -2.4258
quadrupole: 1.1159 -1.5996 0.4838 22.4857 1.0775 -2.4258
hfenergy: -794.9473233 hartree
pointgroup: C01 [X(C9H14N4O3)]
dipole: 2.2510243 -1.6684682 1.7447737 debye
polarizability: 176.0259626|7.7833991|145.0478873|19.7604647|9.3498225|99.2071752 unknown
InChI: InChI=1S/C9H14N4O3/c1-11(2)8(14)4-3-6-12-7-5-10-9(12)13(15)16/h5,7H,3-4,6H2,1-2H3
charge 0 multiplicity 1
30 atoms
O  2.898729 -0.748267 -1.514369
O  -3.555969 2.384623 -0.074098
O  -1.428854 1.972542 0.662369
N  -1.88174 -0.821772 0.429578
N  4.343486 0.105652 0.096633
N  -3.911527 -0.361795 -0.52745
N  -2.593988 1.585148 0.214407
C  0.571767 -0.488236 -0.005593
C  -0.535055 -0.696267 1.048241
C  1.928714 -0.23449 0.6804
C  3.086526 -0.310091 -0.334418
C  -2.800155 0.163216 0.03427
C  -2.463905 -2.03327 0.077083
C  -3.708255 -1.732712 -0.50743
C  5.467949 0.093335 -0.856467
C  4.648151 0.625357 1.43787
H  0.650799 -1.364635 -0.672026
H  0.317954 0.378215 -0.640205
H  -0.558881 0.150538 1.750893
H  -0.356128 -1.627525 1.617242
H  1.911936 0.753766 1.178306
H  2.103679 -0.990201 1.475961
H  -1.963813 -2.980574 0.263618
H  -4.449927 -2.419392 -0.907341
H  5.887402 1.111033 -0.974723
H  5.092448 -0.262809 -1.827357
H  6.271245 -0.581885 -0.504093
H  5.585628 0.169232 1.808291
H  3.851177 0.382539 2.154934
H  4.78601 1.725524 1.424277
