program: Gaussian 09
title: 000211212
version: EM64L-G09RevD.01
frameworkgroup: C1[X(C22H29ClN2O3)]
method: RPBEPBE
basis: SDD
operation: Freq
keyword: #p
keyword: freq=noraman
keyword: PBEPBE/SDD
title: #p freq=noraman PBEPBE/SDD
converged: YES YES NO NO
title: Mulliken charges:
elementType: Cl O O O N N C C C C C C C C C C C C C C C C C C C C C C H H H H H H H H H H H H H H H H H H H H H H H H H H H H H
charge: -0.066686 -0.306165 -0.292335 -0.312430 -0.075067 -0.165890 -0.369765 -0.348233 -0.419069 -0.414156 -0.334646 -0.407884 0.533242 -0.556724 0.615028 -0.298107 -0.341062 -0.617159 -0.569926 -0.221981 -0.242795 -0.247781 0.266847 0.260097 0.010732 -0.527743 -0.524374 -0.524194 0.188747 0.208131 0.207592 0.194848 0.225246 0.202060 0.213434 0.231602 0.178183 0.203094 0.219768 0.225412 0.208574 0.203455 0.248972 0.259633 0.257943 0.250988 0.225790 0.232745 0.219606 0.227325 0.254049 0.212970 0.261481 0.227383 0.232146 0.224947 0.252104
chargesum: 0.00000
title: Mulliken charges with hydrogens summed into heavy atoms:
elementType: Cl O O O N N C C C C C C C C C C C C C C C C C C C C C C
charge: -0.066686 -0.306165 -0.292335 -0.312430 -0.075067 -0.165890 0.027113 0.054208 0.008237 0.030880 0.046632 0.037297 0.533242 -0.144695 0.615028 -0.298107 -0.092090 -0.357526 -0.311983 0.029006 -0.017005 -0.015036 0.266847 0.260097 0.010732 0.173237 0.177461 0.185003
polarizability: 3.74157074e+02 -1.97272580e+01 2.67735535e+02 -1.61198679e+00 5.80306333e+00 2.01830734e+02
1716.lowfreq: -9.1948 -5.6881 -2.5985 -0.0012 0.0012 0.0015 4.9335 8.8662 16.1677
frequency: -3.3207 6.8011 16.0117 30.9220 50.3304 56.6631 67.0051 70.5809 80.3717 88.8609 96.2120 101.1701 117.7741 130.4540 148.9786 160.6803 163.0444 170.3490 173.8375 188.8848 202.8319 230.3478 238.2992 253.6271 260.5400 273.4364 285.9656 294.2995 317.9555 324.5367 325.0481 366.0079 370.0850 399.7311 411.7728 441.4656 446.6447 471.4118 473.9025 489.3384 514.7867 535.8353 548.5990 575.5898 591.5714 622.2743 641.9597 652.3988 657.7481 710.7079 728.1884 732.5052 751.7332 760.0524 765.0004 772.7202 839.4890 849.8462 853.3178 868.2512 882.6325 889.8673 901.6572 924.8095 927.2981 940.8515 949.0078 969.2446 998.9564 1007.1446 1012.7519 1023.1825 1037.8321 1041.4726 1052.0257 1064.1677 1067.5938 1074.9294 1096.6687 1110.9087 1112.2597 1113.4997 1114.5277 1120.5905 1131.9997 1144.9602 1150.7759 1156.1368 1157.8824 1159.6695 1171.8272 1185.4029 1195.8833 1206.1352 1213.1855 1236.8732 1249.2220 1264.2649 1272.4576 1280.9493 1290.1859 1299.3460 1305.9760 1334.2289 1339.0546 1344.1271 1358.5613 1359.9275 1366.8525 1369.6932 1377.7194 1394.5349 1398.3955 1417.2928 1428.0037 1435.1849 1439.0822 1451.7618 1453.9389 1455.8536 1457.7628 1459.1612 1459.9240 1463.1215 1464.3571 1468.4935 1473.6258 1476.1239 1481.5977 1484.2507 1486.6790 1487.6270 1559.3432 1570.9046 1606.3522 1608.2106 2828.7507 2856.6956 2869.3389 2902.7346 2920.8613 2970.8322 2971.5723 2973.2382 2975.5591 2990.2679 2999.1294 3024.6630 3026.4845 3052.6664 3054.1668 3061.9667 3069.6163 3075.3499 3079.7353 3101.7023 3118.2643 3119.6380 3124.7026 3131.8940 3146.8556 3149.6706 3151.8194 3159.3750 3173.8225
redmass: 5.5413 5.0415 4.9902 5.4911 4.5505 3.0623 3.6030 3.5793 2.6886 3.1897 2.1804 3.5026 2.7014 3.1302 1.4826 1.2016 1.1910 3.6945 2.6667 4.1553 2.8659 5.5114 4.7394 3.0439 3.0155 3.5472 3.0827 3.8280 3.4215 3.3579 3.6551 5.0023 3.8370 2.9577 4.5402 4.1401 3.3819 3.4642 4.5687 4.2129 4.4460 4.6287 3.6050 5.2997 5.1131 2.8267 4.3174 4.1248 4.1595 3.7338 4.1406 4.1152 1.3164 1.1636 3.4983 3.5941 1.4261 1.5211 1.4366 4.0827 1.7154 1.5394 6.5035 4.0110 1.4046 9.2858 2.1739 1.3215 3.3729 5.2784 3.9595 4.4162 3.6403 2.3568 1.8419 2.4833 1.9921 1.9827 1.9596 1.2397 1.4287 1.2453 2.2651 1.8268 2.3385 2.9361 1.3561 1.4284 1.6322 1.6694 1.0914 1.9954 1.4075 1.3916 1.5327 1.4982 1.2344 1.4140 1.3816 1.2554 1.2418 2.0202 2.1751 1.5393 1.2968 1.5859 1.7522 6.0330 2.4865 1.5611 1.6428 1.4391 1.8975 1.2574 2.4566 1.2325 1.5766 1.0853 1.2306 1.1021 1.0845 1.0957 1.1160 1.1328 1.6573 1.1783 1.1115 1.0565 2.5205 1.0555 1.0577 1.1023 5.9042 7.3710 6.8218 7.0201 1.0703 1.0705 1.0695 1.0684 1.0712 1.0319 1.0595 1.0336 1.0300 1.0677 1.0783 1.0994 1.0897 1.0904 1.0911 1.1026 1.1030 1.1053 1.0986 1.0894 1.1032 1.1029 1.1044 1.0856 1.0915 1.0892 1.0922 1.0942 1.1004
irintensity: 0.1622 0.1321 0.1716 0.4912 0.6883 3.7205 4.2470 0.6038 3.8284 2.7916 0.1414 3.2937 1.9165 0.4424 1.9496 0.2270 0.1031 2.1974 4.1291 0.8464 7.4339 1.6873 15.7213 4.2449 2.2337 1.0152 1.4132 10.6455 6.0826 2.0923 4.5759 3.8473 0.6488 1.7037 2.0343 3.6328 7.3849 3.0966 2.5157 1.9274 0.1182 2.0423 5.1505 9.7604 3.1618 6.8527 7.2848 13.7513 19.2667 2.1727 8.6252 7.5512 88.6254 4.9109 5.5103 5.7817 0.2250 1.3865 8.5709 7.8352 35.9357 5.3483 25.9024 52.9020 2.8465 55.0414 2.9725 0.1442 44.7873 45.7486 82.0839 116.5647 42.6189 17.3517 1.9150 14.2111 4.9325 11.8812 4.1010 8.9979 13.5876 5.4775 16.2269 11.5102 70.2810 24.2717 1.5625 4.8129 2.2296 27.7909 2.0712 52.8688 6.5531 8.5361 16.4851 102.6977 18.1341 19.3370 13.7756 1.1180 21.8262 73.7261 52.4122 5.9855 14.3344 7.1651 4.0363 14.7800 24.7452 1.0313 51.4926 0.9519 45.4093 2.9076 12.3159 22.4867 19.4476 8.0844 42.1234 30.5084 22.6187 1.9274 46.7811 26.5140 30.6467 6.3577 2.1321 3.0510 114.8769 20.3958 24.7751 13.4358 2.0875 83.7265 98.4438 50.6197 68.0897 73.6056 86.5616 71.4450 94.0515 75.5405 25.5467 95.4354 51.3519 10.2241 42.7774 7.9564 45.7769 65.0390 13.8831 44.6084 27.8871 21.6753 35.3244 6.1501 26.0831 25.0546 16.9483 6.6847 5.3846 8.5195 3.3125 17.1804 16.0059
temp: 298.150 k
press: 1.00000 atm
elementType: 17 8 8 8 7 7 6 6 6 6 6 6 6 6 6 6 6 6 6 6 6 6 6 6 6 6 6 6 1 1 1 1 1 1 1 1 1 1 1 1 1 1 1 1 1 1 1 1 1 1 1 1 1 1 1 1 1
symmnumber: 1
zpe: 1232685.3 jmol-1
zpe.correction: 0.469505 hartree
zpe.thermalcorrener: 0.497738 hartree
zpe.thermalcorrenthalpy: 0.498682 hartree
zpe.thermalcorrgfe: 0.407604 hartree
zpe.sumelectzpe: -1648.774556 hartree
zpe.sumelectthermal: -1648.746323 hartree
zpe.sumelectthermalent: -1648.745379 hartree
zpe.sumelectthermalfe: -1648.836457 hartree
dipole: -0.7119 -1.5928 -1.1432
dipole: 2.0858
quadrupole: -159.0814 -171.2315 -169.5638
quadrupole: -11.2662 9.2515 -3.6780
quadrupole: 7.5441 -4.6059 -2.9382 -11.2662 9.2515 -3.6780
hfenergy: -1649.244061 hartree
pointgroup: C01 [X(C22H29Cl1N2O3)]
dipole: -0.2900496 0.5264569 0.558702 debye
polarizability: 373.3767161|21.2398367|264.1182218|4.8112108|17.5361958|206.2284056 unknown
InChI: InChI=1S/C22H29ClN2O3/c1-26-20-15-17(16-21(27-2)22(20)28-3)7-6-10-24-11-13-25(14-12-24)19-9-5-4-8-18(19)23/h4-5,8-9,15-16H,6-7,10-14H2,1-3H3
charge 0 multiplicity 1
57 atoms
Cl 5.633664 -2.549047 -0.105482
O  -5.436895 1.719071 1.604842
O  -5.758734 -2.462912 -1.037422
O  -6.861191 -0.715413 1.009457
N  1.794057 0.937547 -0.839566
N  4.547492 0.413156 -0.096732
C  2.928638 1.571599 -1.55527
C  2.206599 -0.389653 -0.314251
C  4.147471 1.73277 -0.628727
C  3.421009 -0.247323 0.615072
C  0.577617 0.878423 -1.688817
C  -0.700359 0.513605 -0.906847
C  5.869603 0.243097 0.379266
C  -1.970124 0.641587 -1.792581
C  -3.248455 0.277888 -1.049793
C  6.497927 -1.036495 0.476121
C  6.681945 1.361824 0.744648
C  -3.925171 -0.934005 -1.319566
C  -3.760104 1.134757 -0.042521
C  7.814042 -1.205771 0.93853
C  8.012042 1.209245 1.184946
C  8.585092 -0.076554 1.299425
C  -4.931686 0.793047 0.660549
C  -5.108578 -1.283894 -0.626404
C  -5.639766 -0.404806 0.356924
C  -5.538586 1.20846 2.991237
C  -6.141316 -3.426244 0.018173
C  -7.992716 0.133768 0.560714
H  3.239154 0.972659 -2.449441
H  2.610326 2.571366 -1.906395
H  1.372271 -0.826427 0.261659
H  2.466577 -1.094903 -1.144016
H  4.985232 2.15936 -1.208115
H  3.882575 2.443851 0.1892
H  3.12932 0.365207 1.498994
H  3.734386 -1.240924 0.967876
H  0.70597 0.161047 -2.542735
H  0.44048 1.88381 -2.135353
H  -0.645388 -0.521836 -0.519949
H  -0.782051 1.182541 -0.029367
H  -1.857301 -0.008076 -2.682103
H  -2.036218 1.684412 -2.164063
H  6.244973 2.364144 0.700937
H  -3.557268 -1.628748 -2.081951
H  -3.263275 2.077841 0.209141
H  8.240279 -2.2125 0.986351
H  8.594221 2.097106 1.455614
H  9.613748 -0.207293 1.64937
H  -4.53141 0.964819 3.380414
H  -5.974808 2.033894 3.5745
H  -6.187063 0.315669 3.035727
H  -5.237421 -3.797814 0.53898
H  -6.832006 -2.964432 0.742583
H  -6.629921 -4.254907 -0.516929
H  -8.176256 -0.018796 -0.518869
H  -8.864109 -0.201316 1.144372
H  -7.777236 1.198117 0.764941
