program: Gaussian 09
title: 000211209
version: EM64L-G09RevD.01
frameworkgroup: C1[X(C22H27FN2O4)]
method: RPBEPBE
basis: SDD
operation: Freq
keyword: #p
keyword: freq=noraman
keyword: PBEPBE/SDD
title: #p freq=noraman PBEPBE/SDD
converged: YES YES NO NO
title: Mulliken charges:
elementType: F O O O O N N C C C C C C C C C C C C C C C C C C C C C C H H H H H H H H H H H H H H H H H H H H H H H H H H H
charge: -0.217700 -0.232721 -0.284226 -0.291054 -0.288744 -0.076592 -0.173253 -0.359065 -0.354953 -0.389712 -0.414301 -0.357644 -0.537579 0.477390 0.097036 -0.347063 -0.340499 0.368416 -0.377284 -0.387002 0.311275 -0.540387 -0.507120 0.240377 0.281543 0.061998 -0.497695 -0.532604 -0.521354 0.186727 0.214178 0.204552 0.187176 0.204123 0.218553 0.210182 0.215705 0.238929 0.192612 0.256879 0.235086 0.224555 0.240764 0.248262 0.247304 0.291186 0.269690 0.253670 0.204867 0.228876 0.242201 0.235243 0.228064 0.206774 0.232419 0.271940
chargesum: 0.00000
title: Mulliken charges with hydrogens summed into heavy atoms:
elementType: F O O O O N N C C C C C C C C C C C C C C C C C C C C C C
charge: -0.217700 -0.232721 -0.284226 -0.291054 -0.288744 -0.076592 -0.173253 0.041840 0.036774 0.032964 0.011586 0.073897 -0.045615 0.477390 0.097036 -0.122508 -0.099735 0.368416 -0.129023 -0.139698 0.311275 -0.249201 -0.237429 0.240377 0.281543 0.061998 0.189718 0.172905 0.189779
polarizability: 4.18603698e+02 -2.00222468e+00 2.93335218e+02 -3.21016188e+00 9.29462886e-01 1.47973283e+02
1716.lowfreq: -2.8932 -0.0007 0.0007 0.0008 2.6212 6.4949 12.7606 19.3711 23.0883
frequency: 12.6077 19.1626 22.6545 33.1906 44.4391 57.7400 59.3438 65.0258 80.5403 91.5852 92.7041 97.4867 113.1641 143.3170 146.1697 156.7529 161.7917 186.5813 187.1883 203.1241 217.2507 228.8607 240.8736 250.8040 272.0404 283.1044 292.5817 306.5213 315.0139 347.9593 354.0797 361.8575 378.2522 392.2191 414.5202 424.7659 441.3417 453.4877 466.2290 485.5591 490.3065 514.0442 517.8055 536.5594 578.0901 588.5411 629.8111 640.4533 647.4182 674.5533 682.3346 703.9414 721.7583 753.7484 781.4527 791.4803 795.7970 801.8150 810.6409 846.4403 863.1180 870.1778 876.4026 889.1998 914.5529 918.3961 932.6916 946.9826 954.3993 980.4615 993.1122 1003.2848 1036.4864 1044.3613 1053.6177 1064.9027 1071.9306 1086.7992 1093.3852 1107.3545 1110.0604 1112.7872 1113.1100 1135.1244 1139.1120 1149.5468 1152.8290 1155.8046 1158.6981 1165.5050 1169.8974 1200.7407 1206.3427 1208.8740 1218.4432 1227.5167 1239.0819 1261.0367 1283.1372 1290.1514 1299.5017 1304.7334 1321.0653 1343.7218 1343.9591 1358.8034 1366.7829 1375.8242 1379.8735 1384.1066 1398.2400 1404.8268 1418.1955 1421.4345 1435.2013 1440.4804 1443.5105 1452.9899 1454.0420 1455.4927 1458.3610 1461.0962 1465.2929 1466.6036 1467.9490 1469.8384 1474.9703 1480.1607 1483.7216 1504.5434 1557.5268 1588.3184 1591.2235 1599.6156 1622.3928 2848.9546 2859.7823 2879.0998 2906.4518 2922.2396 2970.8119 2973.2074 2977.8874 2978.3161 3027.5864 3035.8111 3044.2652 3051.3634 3055.0567 3063.4763 3087.2262 3087.6593 3089.4709 3126.5554 3128.7804 3132.3986 3151.3527 3156.4095 3168.2057 3173.0383 3174.4596 3178.1117
redmass: 5.7326 4.5392 4.3964 6.1998 3.0893 3.2746 5.2088 4.0978 5.2081 2.5737 2.0401 2.6627 4.7094 3.1701 2.2885 2.5414 3.4749 1.4887 3.9673 2.8239 1.7062 3.5225 2.0703 3.4926 1.9176 2.5006 4.8758 4.3205 5.0393 5.3850 4.8769 4.7451 5.0443 2.3058 3.0381 4.8117 4.3705 3.9087 4.0942 3.1205 6.6710 3.2590 2.7978 6.1555 4.5893 3.0184 7.0784 3.0528 4.7385 4.9406 3.0234 3.4842 4.3456 3.9182 2.0015 3.1513 1.8261 2.0116 1.7458 1.5660 4.7926 1.6565 4.6839 1.6308 1.6826 2.2901 1.3901 8.7819 2.3444 5.6128 2.8333 2.8844 1.9566 2.8105 1.8536 2.2053 5.0821 2.4448 2.1877 1.2468 1.2401 1.3614 1.2591 2.3732 2.1015 1.8409 1.5092 1.5565 1.6074 2.1672 1.9333 1.4033 1.6624 1.9182 1.7106 1.6256 1.4928 1.3819 1.9644 1.2629 1.3171 1.3919 3.0971 1.4714 1.4931 1.9696 1.6982 1.8325 2.0113 3.9664 1.6038 3.0317 1.2552 3.8258 1.1211 1.2389 1.3284 1.1406 1.0916 1.0858 1.0881 1.0935 1.0549 1.1017 1.4439 1.1191 1.1000 1.4551 1.0707 2.6573 7.6793 7.4762 8.5473 6.6979 6.4872 1.0714 1.0702 1.0706 1.0688 1.0707 1.0323 1.0358 1.0420 1.0523 1.0953 1.0892 1.0893 1.0897 1.0911 1.1044 1.0894 1.0953 1.0965 1.1056 1.1009 1.1052 1.0872 1.0876 1.0904 1.0963 1.0915 1.0966
irintensity: 0.1427 0.0479 0.5115 0.9286 3.8800 1.8366 4.3535 1.4714 1.8054 2.1802 1.5023 8.0088 0.4325 0.7124 1.3721 7.2175 1.3476 0.8167 16.1565 4.5895 0.5135 2.9018 0.3864 7.5693 0.4953 8.0728 7.8452 0.5442 8.0223 6.1902 2.9519 2.5300 4.7698 1.6831 0.6926 10.0097 5.4307 16.1714 0.0743 6.7910 1.6844 8.6948 13.6071 2.8051 2.8650 12.2136 0.1263 5.7066 7.0014 23.3409 36.7704 2.8948 7.4491 12.8453 6.0377 20.8154 16.7696 11.5780 92.3948 3.1445 6.6961 6.3246 18.9470 32.6323 13.1581 16.2059 3.8017 72.3611 17.5066 75.9956 10.2781 31.9078 3.2201 2.3375 3.0946 5.1344 228.0081 11.6793 3.3376 6.3014 25.7375 7.2467 0.6431 134.6037 56.3806 15.1153 29.1037 47.8039 35.2079 57.2042 18.3556 6.2737 13.3468 47.5245 21.9287 15.2889 179.9219 11.9185 100.6484 7.1319 5.9242 26.0390 457.0857 73.3921 0.2321 2.5986 16.9997 20.0311 38.9174 49.5984 1.7821 165.6979 4.8392 3.1057 12.9068 21.5184 40.6423 9.0749 10.8232 2.6182 5.6060 32.2371 15.0453 47.9515 64.7666 35.4400 11.1780 31.6947 15.7095 330.3251 279.6730 1.8975 32.6360 3.7700 38.2384 51.3910 56.3397 116.7997 65.1232 92.8212 60.5630 75.4091 98.4182 11.7518 6.8078 34.9259 51.2897 21.5273 32.5406 37.2794 23.8076 32.4572 48.0988 18.1931 23.6510 12.1367 13.8711 12.3819 8.8627 13.6217 0.8043 1.1622
temp: 298.150 k
press: 1.00000 atm
elementType: 9 8 8 8 8 7 7 6 6 6 6 6 6 6 6 6 6 6 6 6 6 6 6 6 6 6 6 6 6 1 1 1 1 1 1 1 1 1 1 1 1 1 1 1 1 1 1 1 1 1 1 1 1 1 1 1
symmnumber: 1
zpe: 1187596.8 jmol-1
zpe.correction: 0.452332 hartree
zpe.thermalcorrener: 0.481560 hartree
zpe.thermalcorrenthalpy: 0.482504 hartree
zpe.thermalcorrgfe: 0.388952 hartree
zpe.sumelectzpe: -1362.531952 hartree
zpe.sumelectthermal: -1362.502724 hartree
zpe.sumelectthermalent: -1362.501780 hartree
zpe.sumelectthermalfe: -1362.595332 hartree
dipole: -6.9814 0.3009 1.8540
dipole: 7.2296
quadrupole: -184.0684 -157.8001 -175.8499
quadrupole: -13.4256 -14.9572 6.6649
quadrupole: -11.4956 14.7727 -3.2771 -13.4256 -14.9572 6.6649
hfenergy: -1362.9842839 hartree
pointgroup: C01 [X(C22H27F1N2O4)]
dipole: -2.7632126 0.1962802 0.6453297 debye
polarizability: 418.2693545|-6.1927338|293.5231281|5.3249622|3.3995571|148.1197162 unknown
InChI: InChI=1S/C22H27FN2O4/c1-27-20-14-16(15-21(28-2)22(20)29-3)19(26)8-9-24-10-12-25(13-11-24)18-6-4-17(23)5-7-18/h4-7,14-15H,8-13H2,1-3H3
charge 0 multiplicity 1
56 atoms
F  9.946116 1.089605 0.304424
O  -2.267151 -2.647433 -0.029902
O  -4.243717 3.024285 -0.701694
O  -7.112773 -0.944352 -0.337024
O  -6.897865 1.810327 -0.721255
N  1.695757 -1.132105 -0.295044
N  4.498843 -0.451373 0.057036
C  2.751133 -2.170912 -0.387277
C  2.11911 -0.096355 0.676965
C  4.077243 -1.547708 -0.84926
C  3.444051 0.561894 0.249843
C  0.369794 -1.724613 0.01651
C  -0.777677 -0.723828 -0.201447
C  5.85942 -0.051277 0.084669
C  -2.156638 -1.388631 -0.152061
C  6.906304 -1.024352 0.032426
C  6.238345 1.321306 0.207288
C  -3.377225 -0.524839 -0.260136
C  8.261505 -0.649821 0.100269
C  7.594968 1.703628 0.289631
C  8.584208 0.712019 0.231014
C  -4.647363 -1.159443 -0.207374
C  -3.302612 0.875899 -0.415857
C  -4.478451 1.657843 -0.515165
C  -5.819975 -0.395429 -0.322694
C  -5.75879 1.030477 -0.475729
C  -5.234356 4.03307 -0.284357
C  -7.220973 -2.407729 -0.298674
C  -8.002783 1.759016 0.263466
H  2.91036 -2.683082 0.596035
H  2.435047 -2.932373 -1.123934
H  1.347217 0.691404 0.736206
H  2.245456 -0.532964 1.701565
H  4.850054 -2.331221 -0.878611
H  3.946227 -1.158046 -1.884704
H  3.27273 1.152961 -0.680337
H  3.752793 1.256676 1.050424
H  0.212475 -2.587495 -0.654419
H  0.3235 -2.125964 1.059553
H  -0.64401 -0.236365 -1.188595
H  -0.75266 0.090086 0.548877
H  6.665341 -2.089259 -0.032148
H  5.480276 2.108291 0.217464
H  9.056902 -1.400437 0.066938
H  7.878976 2.75641 0.380899
H  -4.663036 -2.246996 -0.095551
H  -2.348908 1.407998 -0.458867
H  -6.093934 4.054265 -0.971159
H  -5.587057 3.841389 0.747309
H  -4.681293 4.984936 -0.317351
H  -8.298789 -2.615648 -0.366915
H  -6.693282 -2.86631 -1.155822
H  -6.81763 -2.815673 0.647552
H  -7.649602 2.111933 1.252379
H  -8.765513 2.446755 -0.131916
H  -8.403288 0.736758 0.343839
