program: Gaussian 09
title: 000211206
version: EM64L-G09RevD.01
frameworkgroup: C1[X(C10H21NO)]
method: RPBEPBE
basis: SDD
operation: Freq
keyword: #p
keyword: freq=noraman
keyword: PBEPBE/SDD
title: #p freq=noraman PBEPBE/SDD
converged: YES YES NO NO
title: Mulliken charges:
elementType: O N C C C C C C C C C C H H H H H H H H H H H H H H H H H H H H H
charge: -0.298472 -0.141876 -0.151636 -0.396009 -0.409792 -0.372308 -0.374476 0.232686 -0.697610 -0.700803 -0.629567 -0.619783 0.196221 0.197855 0.201738 0.237750 0.181263 0.216585 0.232574 0.230253 0.177395 0.205954 0.219414 0.204355 0.213380 0.203531 0.218431 0.228114 0.246245 0.227250 0.219200 0.217424 0.284713
chargesum: 0.00000
title: Mulliken charges with hydrogens summed into heavy atoms:
elementType: O N C C C C C C C C C C
charge: -0.298472 -0.141876 0.044586 0.003584 0.009221 0.076851 0.033173 0.232686 -0.067887 -0.065460 0.072042 0.101553
polarizability: 1.30213597e+02 -6.53386731e+00 1.21680316e+02 5.29986271e+00 -1.44649505e+00 1.05188775e+02
1716.lowfreq: -13.0125 -11.5653 -0.0006 -0.0005 -0.0004 14.2552 31.1467 49.5892 63.2698
frequency: 30.5032 48.6178 63.2428 66.4184 78.4423 87.7659 99.2163 129.1621 153.4708 208.3280 222.6856 226.7667 234.0915 252.5709 274.5670 289.6552 313.9303 380.1288 413.4205 501.8326 530.4586 577.0493 693.6225 724.8998 740.7191 766.5494 845.9430 856.7247 895.1707 904.3917 933.8003 984.9035 1030.8151 1047.2150 1053.5020 1061.8462 1078.0033 1092.1111 1100.1691 1111.8009 1132.7284 1143.4126 1168.5327 1218.7728 1234.8111 1237.8402 1244.9306 1288.4203 1293.6625 1305.6202 1316.9557 1334.1721 1357.8281 1362.5259 1385.3256 1388.4006 1390.4877 1406.4437 1441.9606 1451.9192 1462.1682 1468.4675 1471.2489 1473.1119 1474.6832 1476.0324 1477.5401 1484.1986 1486.1431 1489.8602 1502.9278 1573.7303 2955.6539 2956.0484 2960.8559 2964.9599 2968.6915 2970.2474 2972.0944 2978.0892 2993.3397 3006.6668 3019.3425 3022.3569 3037.1501 3040.5608 3057.3490 3068.3380 3069.8842 3071.0281 3073.3065 3119.0392 3133.6153
redmass: 2.2432 1.6761 2.9026 2.9442 1.8542 1.5122 2.1877 2.6917 1.2376 2.1517 1.4317 1.4690 1.5730 2.4043 2.8524 2.8802 2.6218 3.7607 2.5986 3.8305 3.3575 4.0501 3.1088 1.6819 1.2274 1.7762 2.0533 1.3210 1.5213 1.7051 2.5909 2.2523 2.1879 1.4276 1.8540 2.0089 2.0853 1.2286 1.6277 2.1188 2.3076 1.3945 2.2889 1.4638 3.4486 1.4872 1.3538 1.2680 1.1750 1.1391 1.3551 1.4945 1.5043 1.4894 1.2211 1.8953 1.3290 1.2004 1.1729 1.0838 1.0783 1.0448 1.0673 1.0603 1.0652 1.0436 1.0436 1.0694 1.0837 1.0464 1.2091 5.8574 1.0392 1.0609 1.0621 1.0369 1.0369 1.0468 1.0562 1.0776 1.0604 1.1000 1.1007 1.0939 1.1016 1.1010 1.0978 1.0997 1.1020 1.0989 1.1003 1.0966 1.0929
irintensity: 3.0562 0.1720 0.6539 0.6533 0.0274 0.9262 0.4837 1.8593 0.6454 0.6811 0.4852 0.1425 1.0539 4.5498 3.2019 0.6860 0.1653 16.7816 1.1883 2.7951 4.1468 1.1967 4.6910 12.6932 3.5617 5.2509 0.2914 0.5433 1.1296 8.1528 6.2527 3.4186 4.0330 4.8344 1.0999 5.1734 27.2866 0.6166 45.0177 94.8318 6.5592 0.7498 18.5807 2.2824 22.0678 4.2597 1.4284 1.8682 0.7182 2.5155 0.4119 14.0038 7.2352 1.3619 6.2152 47.7390 20.6906 42.9705 2.6273 14.3662 7.6211 4.9818 2.9976 7.0361 13.4049 8.9557 12.8992 13.2832 8.5162 27.0341 17.7379 218.5508 39.6382 23.2527 25.0953 113.7141 55.9559 16.4149 53.9290 52.3788 24.3822 26.0334 43.5907 8.2559 35.8736 4.1157 3.9930 59.0900 99.8998 38.7577 76.4443 1.8193 16.7878
temp: 298.150 k
press: 1.00000 atm
elementType: 8 7 6 6 6 6 6 6 6 6 6 6 1 1 1 1 1 1 1 1 1 1 1 1 1 1 1 1 1 1 1 1 1
symmnumber: 1
zpe: 774510.2 jmol-1
zpe.correction: 0.294995 hartree
zpe.thermalcorrener: 0.311089 hartree
zpe.thermalcorrenthalpy: 0.312033 hartree
zpe.thermalcorrgfe: 0.250433 hartree
zpe.sumelectzpe: -522.641789 hartree
zpe.sumelectthermal: -522.625695 hartree
zpe.sumelectthermalent: -522.624751 hartree
zpe.sumelectthermalfe: -522.686351 hartree
dipole: 2.0712 -0.4916 3.2401
dipole: 3.8768
quadrupole: -72.6297 -73.5550 -79.5633
quadrupole: -4.9105 0.3789 -2.5799
quadrupole: 2.6196 1.6943 -4.3140 -4.9105 0.3789 -2.5799
hfenergy: -522.9367839 hartree
pointgroup: C01 [X(C10H21N1O1)]
dipole: -0.8248675 0.137733 1.2755564 debye
polarizability: 131.3414856|-5.6955414|120.5411034|-5.409101|0.6722121|105.2000989 unknown
InChI: InChI=1S/C10H21NO/c1-5-7-9(8-6-2)10(12)11(3)4/h9H,5-8H2,1-4H3
charge 0 multiplicity 1
33 atoms
O  -0.105795 0.797213 -1.57802
N  -1.601022 1.389314 0.094813
C  0.340238 -0.139531 0.650601
C  -0.360723 -1.525764 0.838276
C  1.810588 -0.285722 0.187962
C  -0.428747 -2.399946 -0.435852
C  2.631082 1.016534 0.324057
C  -0.457084 0.722538 -0.354799
C  -1.192906 -3.719053 -0.190505
C  4.101479 0.836598 -0.110392
C  -2.133112 1.380988 1.464382
C  -2.3947 2.168504 -0.87266
H  0.355227 0.363532 1.639182
H  -1.39277 -1.375705 1.21794
H  0.186159 -2.080893 1.628532
H  1.823741 -0.605949 -0.869639
H  2.288641 -1.087604 0.78864
H  0.595973 -2.629067 -0.784954
H  -0.911592 -1.83084 -1.252845
H  2.158684 1.803156 -0.295497
H  2.596381 1.369317 1.376584
H  -0.712911 -4.316533 0.608192
H  -1.224103 -4.341034 -1.103857
H  -2.23739 -3.523427 0.119491
H  4.67231 1.777811 -0.006578
H  4.606959 0.064526 0.500839
H  4.161094 0.520157 -1.168451
H  -2.236017 2.417927 1.841504
H  -1.476786 0.830023 2.150656
H  -3.135992 0.908857 1.491847
H  -2.440215 3.233069 -0.570957
H  -3.428371 1.775646 -0.935149
H  -1.911115 2.086555 -1.857445
