program: Gaussian 09
title: 000211197
version: EM64L-G09RevD.01
frameworkgroup: C1[X(C18H22O2)]
method: RPBEPBE
basis: SDD
operation: Freq
keyword: #pfreq=noraman
keyword: PBEPBE/SDD
title: #p freq=noraman PBEPBE/SDD
converged: YES YES NO NO
title: Mulliken charges:
elementType: O O C C C C C C C C C C C C C C C C C C H H H H H H H H H H H H H H H H H H H H H H
charge: -0.305400 -0.215844 -0.155161 -0.405875 -0.401294 -0.372948 -0.372983 0.178077 -0.697295 -0.692082 0.262055 0.104142 0.430591 -0.351219 -0.363817 -0.455657 -0.227697 -0.420291 -0.234344 -0.238923 0.235544 0.195181 0.224991 0.218542 0.204967 0.224538 0.189078 0.221009 0.215340 0.206175 0.215874 0.217885 0.219614 0.206984 0.211654 0.302109 0.263037 0.238632 0.229229 0.238793 0.228446 0.228342
chargesum: 0.00000
title: Mulliken charges with hydrogens summed into heavy atoms:
elementType: O O C C C C C C C C C C C C C C C C C C
charge: -0.305400 -0.215844 0.080382 0.014297 0.022215 0.040668 0.063367 0.178077 -0.057359 -0.053829 0.262055 0.104142 0.430591 -0.049110 -0.100780 -0.217025 0.001532 -0.181499 -0.005898 -0.010581
polarizability: 2.66463848e+02 9.38439890e+00 1.73360020e+02 -8.42162909e+00 -4.31543492e+01 1.79511431e+02
1716.lowfreq: -6.6080 -3.9331 -0.0008 -0.0007 0.0003 6.5652 13.0663 22.9933 52.7622
frequency: 12.4453 22.9394 52.7539 55.0508 60.9958 75.0115 78.3325 101.7753 115.8675 155.0007 177.3137 201.7808 207.4261 229.7639 234.8879 240.7465 268.0807 286.7605 297.4908 318.6064 419.5304 419.7800 431.4391 469.9118 504.0726 509.9744 518.0134 570.7642 596.7663 631.5557 639.1436 708.1151 725.0537 741.1374 748.0865 749.6853 780.2401 786.5161 792.0248 816.6270 846.5634 856.6467 870.3964 884.4201 902.1867 912.6422 925.7636 968.6305 971.5865 986.8796 996.4628 1016.9221 1026.6351 1032.5875 1050.4758 1057.7741 1062.4476 1077.0070 1089.7054 1109.7162 1132.2025 1144.9502 1159.2593 1172.0204 1181.4577 1213.3870 1222.3933 1232.0410 1236.9478 1240.9285 1264.2813 1286.8069 1291.7418 1304.2010 1319.1549 1346.4846 1357.9936 1364.7865 1374.2489 1389.2021 1389.7606 1402.8778 1422.0798 1440.2698 1449.4257 1455.4814 1463.8504 1471.2302 1474.8686 1477.1179 1477.4334 1484.3805 1487.3265 1512.5331 1577.9557 1596.9668 1633.5906 1642.5897 2967.9255 2971.2826 2972.8738 2973.4805 2980.7111 2985.1403 2997.8354 3019.3690 3020.8963 3044.5189 3051.8789 3070.7045 3071.3917 3074.1784 3075.3239 3123.2699 3129.7606 3137.0232 3155.2883 3156.9333 3176.3304 3212.3630
redmass: 4.2531 4.5737 5.4864 3.4738 2.7896 1.7145 1.9954 3.7331 3.4879 4.5395 4.1218 2.9951 2.3492 1.1439 1.5754 2.7311 4.0867 4.0205 3.2650 3.3359 3.3627 4.0346 3.5652 3.3316 5.2361 6.8896 5.1414 3.3617 4.8463 4.2987 3.4797 5.3712 2.1198 1.1363 1.7637 1.4485 3.9581 1.9839 4.0318 1.5275 2.2333 1.3607 2.5766 1.6496 1.7206 1.6457 1.3838 1.3735 2.8987 1.3509 1.3342 3.5234 2.1678 2.2043 2.2200 2.1444 2.3754 2.1607 2.9487 1.8080 2.3324 1.5052 2.1137 1.0818 1.3396 1.9142 1.3268 1.3836 1.9401 1.2835 1.6587 1.2887 1.1389 1.1262 1.3288 1.4561 1.5589 1.4855 2.1387 1.2125 1.2147 3.4946 4.6356 2.7425 2.4350 1.0789 1.0778 1.0657 1.0553 1.0426 1.0427 1.0706 1.0836 3.8282 7.3691 5.6998 7.4513 9.5351 1.0593 1.0503 1.0382 1.0459 1.0632 1.0607 1.0815 1.0964 1.0987 1.1025 1.1006 1.1010 1.1013 1.0994 1.0994 1.0862 1.0872 1.0902 1.0969 1.0965 1.0968 1.0940
irintensity: 0.0026 0.5548 0.2825 0.0827 0.1831 0.0275 0.1572 1.5998 0.4384 1.7501 2.7662 0.2521 0.7909 0.0681 0.5942 0.9089 1.4066 4.7444 0.8886 4.3563 5.7285 5.8183 6.8825 0.0139 0.5053 0.2620 0.5716 11.9897 2.2118 2.4770 0.8891 5.2769 5.8997 4.0081 9.5036 2.6083 1.3458 62.8158 8.3891 87.7612 0.1956 0.9784 0.4203 6.8082 10.2066 21.3382 1.0474 0.8518 5.2415 5.6318 0.0739 25.3938 10.2009 16.9263 89.2923 207.1944 90.0060 4.2901 436.5866 29.7631 2.7427 11.4808 11.7378 0.7851 42.8762 30.9168 8.4501 5.3229 7.0623 0.5283 6.2079 4.9566 3.0302 1.9970 5.1295 17.5033 1.8408 8.2457 29.7553 14.6299 7.5759 22.7459 10.9885 5.3549 19.3791 7.5562 4.6913 4.1768 2.8028 8.4451 14.6242 14.5360 10.7659 17.6270 32.0118 7.9787 45.5126 133.2016 25.7631 8.9867 34.8191 37.6048 51.2647 28.8385 21.8560 9.0845 0.6788 23.6465 8.4149 66.4723 98.9525 41.9599 60.5785 0.8712 2.3017 15.7257 31.4179 31.6431 14.6312 2.9102
temp: 298.150 k
press: 1.00000 atm
elementType: 8 8 6 6 6 6 6 6 6 6 6 6 6 6 6 6 6 6 6 6 1 1 1 1 1 1 1 1 1 1 1 1 1 1 1 1 1 1 1 1 1 1
symmnumber: 1
zpe: 926266.2 jmol-1
zpe.correction: 0.352796 hartree
zpe.thermalcorrener: 0.372876 hartree
zpe.thermalcorrenthalpy: 0.373820 hartree
zpe.thermalcorrgfe: 0.301537 hartree
zpe.sumelectzpe: -848.100312 hartree
zpe.sumelectthermal: -848.080232 hartree
zpe.sumelectthermalent: -848.079288 hartree
zpe.sumelectthermalfe: -848.151571 hartree
dipole: 0.2618 1.2732 -1.1630
dipole: 1.7442
quadrupole: -106.7971 -120.2809 -117.7176
quadrupole: -3.6182 3.8231 -4.7488
quadrupole: 8.1348 -5.3490 -2.7857 -3.6182 3.8231 -4.7488
hfenergy: -848.4531077 hartree
pointgroup: C01 [X(C18H22O2)]
dipole: 0.1003482 -0.4703769 0.489445 debye
polarizability: 266.351292|-7.8466386|167.8395338|10.094349|-42.4563479|185.1444742 unknown
InChI: InChI=1S/C18H22O2/c1-3-8-15(9-4-2)18(19)20-17-13-7-11-14-10-5-6-12-16(14)17/h5-7,10-13,15H,3-4,8-9H2,1-2H3
charge 0 multiplicity 1
42 atoms
O  -0.1814 0.096304 0.082086
O  -1.729879 1.06354 -1.408373
C  -2.49771 -0.330257 0.501563
C  -3.895172 0.322196 0.386454
C  -2.50362 -1.862061 0.174023
C  -3.979777 1.724956 1.031537
C  -2.98238 -2.228269 -1.249773
C  -1.48471 0.375636 -0.396157
C  -5.391771 2.338181 0.919548
C  -2.918208 -3.75033 -1.501643
C  1.043523 0.51349 -0.519158
C  2.206464 0.024138 0.177959
C  3.511117 0.383839 -0.337788
C  1.149338 1.314991 -1.65998
C  2.119087 -0.79696 1.349312
C  3.604721 1.205912 -1.50941
C  2.449876 1.656297 -2.147973
C  4.679074 -0.096287 0.342596
C  3.277378 -1.247845 1.987751
C  4.568524 -0.895903 1.481793
H  -2.129477 -0.227542 1.541944
H  -4.63194 -0.349859 0.871565
H  -4.178635 0.401414 -0.67981
H  -1.483358 -2.263927 0.331349
H  -3.16126 -2.356316 0.91746
H  -3.248285 2.39664 0.541185
H  -3.687058 1.658454 2.099692
H  -2.361909 -1.70246 -2.001876
H  -4.019951 -1.873201 -1.399737
H  -6.144549 1.70115 1.42183
H  -5.692457 2.442163 -0.139874
H  -5.434163 3.340857 1.382644
H  -3.265431 -4.004206 -2.519659
H  -3.552601 -4.300931 -0.781126
H  -1.883518 -4.126702 -1.393409
H  0.255421 1.673539 -2.169629
H  1.129969 -1.060718 1.732591
H  4.59552 1.474211 -1.893438
H  2.52303 2.28447 -3.042134
H  5.665443 0.177619 -0.050357
H  3.199802 -1.874955 2.882719
H  5.468231 -1.256366 1.992406
