program: Gaussian 09
title: 000211188
version: EM64L-G09RevD.01
frameworkgroup: C1[X(C16H24N2O2)]
method: RPBEPBE
basis: SDD
operation: Freq
keyword: #p
keyword: freq=noraman
keyword: PBEPBE/SDD
title: #p freq=noraman PBEPBE/SDD
converged: YES YES NO NO
title: Mulliken charges:
elementType: O O N N C C C C C C C C C C C C C C C C H H H H H H H H H H H H H H H H H H H H H H H H
charge: -0.436918 -0.439540 -0.168536 -0.172507 0.222041 0.221604 -0.503957 -0.506289 0.429752 0.429762 -0.799528 -0.797031 -0.405383 -0.405046 -0.408590 -0.418239 -0.417145 -0.407263 -0.324392 -0.329749 0.217116 0.243760 0.219133 0.242567 0.230464 0.211508 0.231909 0.219000 0.233088 0.228262 0.248535 0.156151 0.215710 0.190439 0.226094 0.274774 0.276196 0.229002 0.200015 0.238027 0.232197 0.208083 0.331022 0.333902
chargesum: 0.00000
title: Mulliken charges with hydrogens summed into heavy atoms:
elementType: O O N N C C C C C C C C C C C C C C C C
charge: -0.105896 -0.105638 -0.168536 -0.172507 0.222041 0.221604 -0.043081 -0.044589 0.429752 0.429762 -0.125647 -0.116682 -0.000696 0.001103 -0.182496 -0.143465 -0.140949 -0.178261 0.113650 0.110531
polarizability: 2.74664898e+02 2.84109754e-01 1.50314391e+02 -2.08297562e+00 -2.86361338e-01 1.71550225e+02
1716.lowfreq: -0.0001 0.0008 0.0008 6.3649 7.3653 15.5238 20.5208 32.3865 51.5162
frequency: 20.4176 32.3731 51.4459 52.1107 77.3096 78.3914 92.5002 92.7762 97.9875 118.2016 180.2958 195.8467 222.8731 229.1376 235.5558 272.1165 278.8123 296.9300 309.8240 320.7034 331.4334 355.3479 370.6889 388.8931 391.1535 410.9523 411.1254 442.9268 461.9361 466.3198 499.7433 530.8898 574.3973 593.4955 635.2662 685.3894 693.8806 727.3580 758.8909 801.0831 809.0116 814.0948 821.5710 857.5455 860.4109 908.6621 909.5676 934.9141 935.8326 965.0714 967.8202 977.6169 991.1126 1009.2576 1029.4212 1030.6278 1046.4768 1049.4717 1054.8140 1060.4974 1078.2699 1081.4668 1088.2603 1092.2154 1102.2513 1109.1029 1124.6621 1142.7006 1145.0211 1160.0914 1162.6599 1196.1026 1263.5365 1268.7208 1279.6268 1280.6906 1295.5500 1301.3569 1312.0016 1313.1900 1322.6365 1344.4195 1347.4679 1367.7729 1379.9480 1381.7258 1391.9398 1395.6922 1410.5384 1460.1784 1460.7860 1470.5822 1471.6475 1473.3535 1474.5956 1480.6041 1480.8458 1497.9676 1498.3298 1507.4553 1571.4109 1624.4162 2871.6710 2922.5996 2970.5175 2985.4809 2986.2716 2987.3511 2999.0891 3034.5975 3036.4128 3036.7189 3071.6130 3072.3985 3086.7522 3090.5513 3091.5225 3103.0800 3133.0025 3134.5333 3150.8433 3150.9965 3152.9168 3157.8052 3558.9550 3563.0793
redmass: 5.1911 4.7408 3.9611 5.1990 4.0767 3.9898 1.8984 1.8347 4.4666 3.8993 4.6832 2.7574 1.2001 1.3171 3.0359 2.5096 2.3879 1.8119 2.4898 1.2815 1.5118 3.0480 3.2418 3.8818 3.6258 2.9897 3.2523 2.8894 3.4815 3.6683 3.6895 3.2858 2.6269 3.7416 6.9237 4.0183 4.2857 4.4919 3.5089 2.1863 1.2199 1.4540 2.5620 1.2756 1.6287 1.4588 1.5082 2.3434 2.3454 3.5367 3.9002 1.3162 1.3472 3.0960 1.9974 2.0905 1.4982 1.5820 1.5826 1.5461 2.0839 2.1379 1.9327 1.4586 1.6092 1.6998 1.5518 2.9323 2.4778 1.2448 1.2680 1.1672 1.4646 1.4906 1.9765 2.0748 1.2634 1.2299 3.4098 1.5098 5.1111 1.2532 1.2773 5.1364 1.2979 1.2680 1.4200 1.2452 2.6605 1.0811 1.0818 1.1099 1.0966 1.0873 1.0835 1.0827 1.0774 1.0638 1.0693 2.5947 7.2541 6.3685 1.0701 1.0645 1.0694 1.0365 1.0688 1.0372 1.0913 1.0697 1.0717 1.0572 1.0987 1.0988 1.0981 1.0981 1.0991 1.0962 1.0868 1.0869 1.1141 1.1139 1.0949 1.0960 1.0662 1.0663
irintensity: 0.1415 0.4852 0.3429 0.5997 1.1106 0.5528 11.2163 3.0095 1.7708 5.3559 0.1423 0.6861 0.2761 1.0523 0.2653 10.0364 16.4473 25.4252 17.4636 153.2682 88.4731 4.1108 1.3926 0.9833 2.8454 0.0426 0.8199 5.2878 15.0764 0.4881 2.5770 0.5998 15.8754 5.7815 0.3546 6.5032 7.4469 13.6458 0.4780 1.8531 4.0237 9.6873 5.2682 3.9500 40.2972 6.7331 1.1625 20.7545 10.6879 123.9178 102.4809 0.5085 0.8013 18.5041 37.1449 34.5060 3.8302 7.6638 5.0109 9.1156 1.7533 0.7554 1.8924 11.6646 3.8034 6.5404 28.1706 27.3165 35.3948 13.3713 11.6827 2.0294 9.7489 3.5726 3.5413 8.2528 3.2119 2.1461 115.8133 1.5801 10.4773 51.3466 33.5764 2.9747 0.2411 1.1139 27.2588 1.5828 25.9191 5.2846 2.6935 4.4063 3.0853 2.3681 3.4314 2.9247 0.6529 18.3268 27.4464 48.3596 0.0688 0.0922 117.7123 77.1424 49.1583 24.5089 55.3165 22.4540 40.2302 27.1780 46.9947 46.2912 22.9422 26.1410 37.1137 25.4835 35.4683 21.3037 8.0931 5.8037 32.7023 17.6433 19.7036 0.2535 8.5968 7.4527
temp: 298.150 k
press: 1.00000 atm
elementType: 8 8 7 7 6 6 6 6 6 6 6 6 6 6 6 6 6 6 6 6 1 1 1 1 1 1 1 1 1 1 1 1 1 1 1 1 1 1 1 1 1 1 1 1
symmnumber: 1
zpe: 973647.4 jmol-1
zpe.correction: 0.370843 hartree
zpe.thermalcorrener: 0.392379 hartree
zpe.thermalcorrenthalpy: 0.393323 hartree
zpe.thermalcorrgfe: 0.319331 hartree
zpe.sumelectzpe: -882.385933 hartree
zpe.sumelectthermal: -882.364396 hartree
zpe.sumelectthermalent: -882.363452 hartree
zpe.sumelectthermalfe: -882.437445 hartree
dipole: -0.1919 -3.1361 2.7879
dipole: 4.2005
quadrupole: -110.7996 -132.9263 -114.3603
quadrupole: -0.1888 9.3201 8.0255
quadrupole: 8.5625 -13.5642 5.0018 -0.1888 9.3201 8.0255
hfenergy: -882.7567754 hartree
pointgroup: C01 [X(C16H24N2O2)]
dipole: 0.1188164 1.0787396 -1.2463276 debye
polarizability: 274.6317718|-2.6605679|171.5680507|-0.9609094|-0.4893114|150.3296917 unknown
InChI: InChI=1S/C16H24N2O2/c1-15(11-17(15)7-9-19)13-3-5-14(6-4-13)16(2)12-18(16)8-10-20/h3-6,19-20H,7-12H2,1-2H3
charge 0 multiplicity 1
44 atoms
O  -5.91319 -0.200423 2.857586
O  5.948533 0.137962 2.776763
N  -3.797611 -0.398988 -0.267644
N  3.791827 0.397273 -0.320353
C  -2.856547 0.757829 -0.604591
C  2.84637 -0.769867 -0.613242
C  -3.752735 0.112354 -1.674591
C  3.727075 -0.154785 -1.712608
C  -1.391525 0.375354 -0.56906
C  1.382141 -0.384784 -0.572766
C  -3.196125 2.188031 -0.187558
C  3.189856 -2.187097 -0.157214
C  -5.028022 -0.181768 0.528441
C  5.03628 0.187959 0.458801
C  -0.362398 1.353381 -0.586238
C  0.997089 0.98043 -0.58746
C  -1.006489 -0.989714 -0.545838
C  0.353003 -1.362588 -0.547939
C  -4.696917 -0.254622 2.032001
C  4.728042 0.273356 1.966399
H  -4.602973 0.710487 -2.038671
H  -3.309111 -0.563772 -2.414112
H  4.572774 -0.762508 -2.070772
H  3.272082 0.499419 -2.464955
H  -2.776196 2.910932 -0.910093
H  -4.28602 2.358682 -0.16396
H  -2.783179 2.425916 0.809687
H  4.279681 -2.353706 -0.122151
H  2.775286 -2.399411 0.844848
H  2.774341 -2.930657 -0.861242
H  -5.729899 -0.999472 0.279727
H  -5.554853 0.779562 0.305625
H  5.728931 1.006749 0.174891
H  5.564835 -0.769881 0.250298
H  -0.614523 2.419326 -0.592135
H  1.786867 1.738836 -0.569755
H  -1.795726 -1.747262 -0.495616
H  0.605604 -2.427985 -0.522888
H  -3.983109 0.548005 2.313285
H  -4.237269 -1.226898 2.266293
H  4.091147 -0.568413 2.282665
H  4.192464 1.219987 2.183055
H  -6.352764 0.678178 2.730078
H  6.526553 0.927196 2.622107
