program: Gaussian 09
title: 000211169
version: EM64L-G09RevD.01
frameworkgroup: C1[X(C25H30N4)]
method: RPBEPBE
basis: SDD
operation: Freq
keyword: #pfreq=noraman
keyword: PBEPBE/SDD
title: #p freq=noraman PBEPBE/SDD
converged: YES YES NO NO
title: Mulliken charges:
elementType: N N N N C C C C C C C C C C C C C C C C C C C C C C C C C H H H H H H H H H H H H H H H H H H H H H H H H H H H H H H
charge: -0.084441 -0.035280 -0.408356 -0.408367 -0.383705 -0.464620 -0.385044 -0.346227 -0.475968 -0.347764 -0.372195 -0.553993 -0.559704 0.423848 0.418620 0.107679 0.101821 -0.448354 -0.456611 0.233144 0.221570 -0.409873 -0.401992 -0.356480 -0.356322 -0.265034 -0.258421 -0.226240 -0.225901 0.203192 0.197883 0.218784 0.221128 0.212932 0.207212 0.179845 0.215281 0.214606 0.213586 0.216214 0.193852 0.208333 0.220030 0.214748 0.203325 0.224716 0.217697 0.267931 0.267439 0.302382 0.299957 0.227459 0.225512 0.226350 0.222531 0.220199 0.241808 0.221854 0.217429
chargesum: 0.00000
title: Mulliken charges with hydrogens summed into heavy atoms:
elementType: N N N N C C C C C C C C C C C C C C C C C C C C C C C C C
charge: -0.084441 -0.035280 -0.105974 -0.108411 0.017370 -0.024708 0.035101 0.048899 -0.047777 0.062302 0.056168 -0.135920 -0.117292 0.423848 0.418620 0.107679 0.101821 -0.180423 -0.189172 0.233144 0.221570 -0.182414 -0.176480 -0.130131 -0.133791 -0.044835 -0.016613 -0.004386 -0.008473
polarizability: 2.93282251e+02 -3.74028027e+01 3.28875831e+02 -7.80703126e-01 -6.42225745e-01 2.44078562e+02
1716.lowfreq: -4.2289 -0.0008 -0.0007 0.0003 3.8486 8.9514 9.9215 17.7567 19.2543
frequency: 6.4462 17.6444 19.0505 32.1761 34.7247 52.2833 63.1982 73.4002 104.6730 117.1732 125.0011 175.9885 182.1905 192.4959 217.2618 221.4660 224.0320 233.2388 242.2666 269.0636 302.5684 324.2790 343.7365 353.6679 386.1285 398.0014 420.5840 423.3013 425.0826 449.4400 458.8701 466.0738 493.8555 500.3218 533.3300 535.9150 560.2800 570.6328 575.0935 576.3896 592.3080 610.8506 630.6850 641.9503 706.6788 730.7008 741.3540 742.9658 745.2511 748.9228 751.6854 758.5865 768.6752 770.0483 782.5982 787.2353 798.5778 809.0221 831.3401 840.6317 845.5278 850.3138 866.7044 867.4624 880.2005 912.9917 926.1743 930.2189 966.0877 977.8593 978.0936 996.0794 1003.5392 1009.5331 1010.6535 1013.5447 1018.8055 1029.7584 1054.3370 1068.7352 1069.5564 1084.0229 1093.0378 1093.4688 1116.7123 1130.2495 1132.8360 1138.2497 1148.9222 1161.7989 1168.4185 1171.0072 1195.7317 1215.5658 1225.5313 1232.8048 1237.8902 1240.4047 1249.8359 1255.8039 1262.2323 1270.3162 1284.2485 1292.8226 1296.7043 1300.4579 1310.2443 1318.7000 1327.2057 1338.4119 1342.0523 1346.6222 1348.0867 1349.3848 1369.1904 1374.4943 1380.5705 1387.4683 1389.0974 1389.6493 1418.8054 1419.8093 1451.0111 1453.0343 1457.5264 1459.2702 1463.0352 1465.5050 1469.5128 1475.3844 1480.8565 1481.3826 1481.9838 1490.6127 1501.1224 1561.5749 1565.0118 1584.8287 1586.1327 1629.7545 1630.1386 2870.7409 2889.5365 2896.5916 2902.8219 2953.7992 2964.6416 2972.0880 2983.1433 2984.7904 2990.1407 3015.3172 3018.6966 3022.3199 3027.9412 3043.0233 3050.2931 3050.8854 3054.5020 3120.3540 3120.9633 3127.7318 3127.8872 3141.2710 3142.5368 3158.9159 3161.4590 3218.0261 3218.9369 3614.2537 3615.0509
redmass: 4.7776 6.5361 4.9082 5.0644 4.3482 4.1822 3.5680 3.3387 2.9209 2.4744 3.2351 4.0878 3.0521 3.6605 3.7761 3.9664 3.1548 2.9351 3.1677 2.3476 2.7169 2.9787 3.3119 3.9104 3.2803 3.4147 2.7917 2.8038 2.7943 3.0018 3.4491 2.9019 1.2363 1.2164 5.0480 5.5396 3.1460 4.7164 3.0125 3.0193 3.0136 3.2008 3.1151 3.3955 3.3117 3.4606 3.1561 2.2602 1.3700 3.5988 1.3623 2.8425 2.1216 2.7549 1.7517 1.4156 1.5499 1.7534 2.2090 3.0002 1.5031 1.4795 5.0008 5.0132 1.9375 2.5904 1.3859 1.3725 1.2956 1.9810 1.4141 2.6811 2.0639 2.0077 2.2053 2.2682 3.0847 2.6294 2.6219 3.0640 3.3132 2.6157 1.5826 1.5844 1.9774 1.4754 1.4677 1.9038 1.9152 1.3537 1.1466 1.1567 1.4213 1.2649 1.7001 1.5814 2.1240 1.6875 1.3152 1.5331 1.4250 1.4825 1.5401 1.7559 1.2680 2.0157 1.4007 1.4164 1.3220 1.2357 1.3559 1.7201 1.6861 1.3238 1.5929 1.3344 1.3693 2.7653 5.1570 1.7218 2.4206 2.3308 1.0960 1.0871 3.8996 4.1085 1.0910 1.0965 1.0962 1.0999 2.9843 2.2560 1.2412 1.0816 1.0861 6.2378 6.2761 6.1953 6.2256 6.8760 6.8644 1.0686 1.0704 1.0699 1.0686 1.0656 1.0831 1.0636 1.0625 1.0617 1.0691 1.0888 1.0940 1.0934 1.0914 1.1001 1.1003 1.1005 1.0987 1.0851 1.0850 1.0888 1.0889 1.0951 1.0950 1.1001 1.1000 1.0981 1.0982 1.0809 1.0808
irintensity: 0.7311 0.0491 0.2719 0.3318 0.8627 0.8898 0.8905 0.1125 0.3947 0.3893 0.1664 2.2643 1.6715 1.9047 7.2741 5.4335 3.2038 0.5820 1.3390 1.5991 8.4971 5.6665 6.2016 1.1652 1.7490 1.4829 10.5197 13.5941 4.0508 1.7306 1.7254 5.7860 92.4674 102.9043 0.7749 1.9842 9.9832 6.9357 10.3258 9.0418 4.7282 5.6627 0.8696 4.1703 0.7325 3.2978 1.1555 7.6914 117.0800 5.3676 97.6741 10.8532 11.5945 7.4326 11.8771 5.2948 18.5290 8.2206 2.3754 4.7600 0.2626 0.8015 0.3957 1.4343 4.4682 3.9242 2.4878 2.2689 0.0701 4.0197 1.2026 0.9546 7.3365 4.1349 9.3125 16.7918 8.1448 8.4402 14.5475 18.0425 3.9971 46.3420 47.1222 33.9419 54.3198 3.9072 1.8539 23.9326 29.2244 17.1193 2.2633 10.5972 6.8068 4.8813 6.8477 8.5657 14.2233 22.6614 4.1993 5.0941 6.1908 3.2438 2.3239 0.3851 4.8448 6.5088 0.0296 11.8686 11.7321 1.3249 21.2970 12.2923 17.0768 8.9074 21.5153 21.2547 7.3356 19.4609 39.7432 17.6304 3.2088 3.0619 2.9670 6.3672 24.0937 19.0367 8.9010 2.3374 14.0239 10.2276 2.7231 5.4045 3.2133 17.2810 5.7903 1.0936 2.4082 0.1960 0.0600 2.2917 1.6943 62.2191 24.5114 257.9956 26.6584 43.1077 41.1550 45.0803 63.4321 19.1441 134.7200 11.9035 4.2959 5.8614 5.3868 38.9560 19.7059 94.0783 70.1734 5.4155 4.1038 1.1699 4.1537 35.8956 41.6067 18.1162 27.8633 1.7631 1.5081 58.0859 60.0886
temp: 298.150 k
press: 1.00000 atm
elementType: 7 7 7 7 6 6 6 6 6 6 6 6 6 6 6 6 6 6 6 6 6 6 6 6 6 6 6 6 6 1 1 1 1 1 1 1 1 1 1 1 1 1 1 1 1 1 1 1 1 1 1 1 1 1 1 1 1 1 1
symmnumber: 1
zpe: 1314234.0 jmol-1
zpe.correction: 0.500565 hartree
zpe.thermalcorrener: 0.526185 hartree
zpe.thermalcorrenthalpy: 0.527129 hartree
zpe.thermalcorrgfe: 0.441426 hartree
zpe.sumelectzpe: -1187.526807 hartree
zpe.sumelectthermal: -1187.501187 hartree
zpe.sumelectthermalent: -1187.500243 hartree
zpe.sumelectthermalfe: -1187.585946 hartree
dipole: -0.4358 -1.0601 -2.6420
dipole: 2.8799
quadrupole: -156.8244 -158.6047 -164.1134
quadrupole: 1.3552 -2.7663 9.0515
quadrupole: 3.0231 1.2428 -4.2659 1.3552 -2.7663 9.0515
hfenergy: -1188.0273725 hartree
pointgroup: C01 [X(C25H30N4)]
dipole: -0.4405452 -0.0749119 -1.041211 debye
polarizability: 270.8534129|-10.6597098|344.6741857|-6.626935|24.6590381|250.7090457 unknown
InChI: InChI=1S/C25H30N4/c1-3-8-24-22(6-1)20(18-26-24)10-14-28-12-5-13-29(17-16-28)15-11-21-19-27-25-9-4-2-7-23(21)25/h1-4,6-9,18-19,26-27H,5,10-17H2
charge 0 multiplicity 1
59 atoms
N  1.410894 2.596954 -0.268023
N  -1.323851 2.712044 0.983042
N  3.273623 -2.491356 -2.867153
N  -5.212235 -1.645917 -0.575243
C  0.336971 3.389669 -0.881273
C  -0.805408 3.789744 0.116981
C  1.906929 3.055684 1.036079
C  -0.368778 2.145845 1.983123
C  0.885938 3.004509 2.244803
C  1.571211 1.180245 -0.624413
C  -2.073223 1.662665 0.258868
C  3.013977 0.806861 -1.090591
C  -3.023973 0.852135 1.184112
C  3.111294 -0.632434 -1.53421
C  -3.671171 -0.307276 0.466964
C  2.969004 -1.821253 -0.704818
C  -3.011166 -1.529329 0.02586
C  3.293495 -1.086731 -2.840634
C  -5.006775 -0.420654 0.082545
C  3.072226 -2.970936 -1.568956
C  -4.002207 -2.348604 -0.624182
C  2.765536 -2.03065 0.68636
C  -1.67887 -2.015959 0.123422
C  2.971129 -4.295043 -1.086453
C  -3.697941 -3.615477 -1.170984
C  2.664008 -3.347741 1.174842
C  -1.366734 -3.277617 -0.418538
C  2.76304 -4.468926 0.297158
C  -2.366761 -4.068124 -1.06058
H  -0.085238 2.805598 -1.720044
H  0.736605 4.334917 -1.318127
H  -0.44554 4.615024 0.758054
H  -1.653042 4.203648 -0.465387
H  2.276743 4.09737 0.934729
H  2.791218 2.441833 1.289332
H  -0.037418 1.129754 1.661237
H  -0.898686 2.005826 2.947717
H  1.398359 2.581252 3.131503
H  0.576033 4.026633 2.534812
H  0.876938 0.945327 -1.452307
H  1.293448 0.496361 0.210732
H  -1.388258 0.942448 -0.25373
H  -2.67997 2.145982 -0.530446
H  3.292889 1.488635 -1.915086
H  3.721563 1.006328 -0.260115
H  -2.444484 0.471699 2.0479
H  -3.786184 1.541023 1.592825
H  3.437091 -0.510602 -3.753348
H  -5.827398 0.279038 0.233258
H  3.384507 -3.066706 -3.69852
H  -6.100954 -1.97447 -0.94477
H  2.693831 -1.17984 1.373767
H  -0.898541 -1.421961 0.613173
H  3.050928 -5.159151 -1.755951
H  -4.461777 -4.228971 -1.662763
H  2.506094 -3.520949 2.245151
H  -0.340758 -3.656851 -0.348955
H  2.678816 -5.481772 0.706827
H  -2.094603 -5.046051 -1.473977
