program: Gaussian 09
title: 000211151
version: EM64L-G09RevD.01
frameworkgroup: C1[X(C8H3BrN2)]
method: RPBEPBE
basis: SDD
operation: Freq
keyword: #p
keyword: freq=noraman
keyword: PBEPBE/SDD
title: #p freq=noraman PBEPBE/SDD
converged: NO YES NO NO
title: Mulliken charges:
elementType: Br N N C C C C C C C C H H H
charge: 0.103082 0.010084 0.001845 0.514408 0.421050 -0.499096 -0.391193 -0.356890 -0.153229 -0.235187 -0.245730 0.290736 0.272594 0.267526
chargesum: 0.00000
title: Mulliken charges with hydrogens summed into heavy atoms:
elementType: Br N N C C C C C C C C
charge: 0.103082 0.010084 0.001845 0.514408 0.421050 -0.208360 -0.391193 -0.084296 0.114296 -0.235187 -0.245730
polarizability: 1.86266630e+02 9.37389938e+00 1.14764547e+02 -1.31632702e-03 1.06816607e-02 4.03157731e+01
1716.lowfreq: -5.0438 -2.7158 -1.3233 0.0003 0.0004 0.0007 72.9968 112.2108 127.4137
frequency: 72.9959 112.2107 127.4132 129.3721 227.2732 250.9615 264.7917 379.9676 429.0697 462.6747 498.7881 508.8157 539.9393 607.3268 643.3804 692.3368 736.8084 845.5922 901.8375 933.5840 979.4714 1015.1748 1144.8940 1160.1032 1228.9201 1274.4257 1358.1947 1379.4296 1454.5461 1554.7817 1593.7273 2186.3894 2190.6832 3164.3771 3172.6335 3183.7480
redmass: 9.3422 14.5297 13.4793 6.0598 8.9358 8.4670 14.8839 4.5012 5.4383 11.0550 9.5722 5.0715 8.2869 7.2177 5.2585 7.5083 3.6246 1.3771 5.3634 1.5581 1.3762 7.6209 1.7504 1.7081 2.6251 1.5763 10.3981 3.2293 2.6985 7.1817 6.0704 12.6294 12.6283 1.0896 1.0940 1.0980
irintensity: 2.5910 4.5787 1.9079 2.7994 1.0567 0.2808 2.5296 0.1494 5.2149 0.0938 1.5889 9.7785 10.7056 3.5952 6.2932 3.3684 0.0773 36.9211 4.3753 29.8169 0.1923 63.9879 3.0593 2.1023 1.8139 2.0937 0.4151 12.7598 71.9509 1.3697 22.8891 22.0322 5.2217 0.2377 0.0657 0.7980
temp: 298.150 k
press: 1.00000 atm
elementType: 35 7 7 6 6 6 6 6 6 6 6 1 1 1
symmnumber: 1
zpe: 223741.4 jmol-1
zpe.correction: 0.085219 hartree
zpe.thermalcorrener: 0.094736 hartree
zpe.thermalcorrenthalpy: 0.095680 hartree
zpe.thermalcorrgfe: 0.048794 hartree
zpe.sumelectzpe: -428.843924 hartree
zpe.sumelectthermal: -428.834407 hartree
zpe.sumelectthermalent: -428.833462 hartree
zpe.sumelectthermalfe: -428.880349 hartree
dipole: 0.9218 -3.7322 -0.0006
dipole: 3.8444
quadrupole: -93.7454 -73.5984 -72.8014
quadrupole: -4.8464 -0.0002 -0.0003
quadrupole: -13.6970 6.4500 7.2470 -4.8464 -0.0002 -0.0003
hfenergy: -428.9291428 hartree
pointgroup: C01 [X(C8H3Br1N2)]
dipole: 0.0322378 1.5121419 -0.0002363 debye
dipolederiv: -0.5771687 0.2718968 -0.0000041 0.2577544 -0.1000372 0.0000065 0.0000331 -0.0000104 0.0445899 -0.1977334 -0.0335623 -0.0000143 -0.027468 -0.2555565 -0.0000062 -0.00004 0.0000213 -0.2206305 -0.3814794 0.0354747 -0.0000161 0.0579688 -0.214655 0.0000048 -0.0000041 0.0000013 -0.2273153 -0.2170436 0.1878356 0.0000138 0.169785 -0.0023905 0.0000334 0.0000053 0.000013 0.1813237 0.0042345 0.0094306 -0.0000045 0.0528967 0.0059849 0.0000348 0.0000065 0.000015 0.1294394 0.1185629 -0.0157549 -0.0000068 0.0441125 -0.0065651 -0.0000137 -0.0000075 -0.0000245 -0.1197723 1.1087854 -0.5366477 0.0000019 -0.3158044 0.2446516 -0.0000299 -0.0000533 -0.0000182 -0.1522729 0.1128415 0.0177719 -0.0000083 -0.1757432 0.1147824 -0.0000283 0.0000178 -0.000031 -0.1202313 -0.5670265 0.0538978 0.0000223 0.0096328 0.0752372 -0.0000867 0.0000306 -0.0000267 -0.064206 0.0765299 0.1251558 -0.0000095 0.0705948 0.1085073 -0.0000101 0.000029 -0.0000157 0.0257184 0.3455304 -0.1190326 0.0000298 -0.1417225 -0.030932 -0.0000089 0.0000048 0.0000074 0.0219193 0.0825281 0.0264068 -0.0000031 0.0169552 0.0171967 0.0000269 -0.0000025 0.0000212 0.1717748 0.0105393 -0.0539847 0.000012 -0.0422801 0.0544093 0.0000167 -0.0000011 0.000019 0.1674348 0.0808997 0.031112 -0.0000132 0.0233179 -0.010633 0.0000607 -0.0000187 0.0000283 0.1622279 unknown
polarizability: 186.1315018|-9.8749024|114.8996755|-0.0015107|-0.0106559|40.3157731 unknown
InChI: InChI=1S/C8H3BrN2/c9-8-2-1-6(4-10)3-7(8)5-11/h1-3H
charge 0 multiplicity 1
14 atoms
Br -2.990994 1.664601 -0.000182
N  -2.854174 -2.195308 0.000378
N  3.987659 -0.818913 0.000037
C  -0.918642 -0.410718 0.000042
C  1.500375 0.049851 -0.000057
C  0.424797 -0.870945 0.000078
C  -1.167368 0.99302 -0.000131
C  1.230927 1.446864 -0.00023
C  -0.097737 1.912642 -0.000267
C  -1.987331 -1.372654 0.000175
C  2.858953 -0.424906 -0.000018
H  0.620212 -1.946947 0.000211
H  2.060555 2.159738 -0.000335
H  -0.302831 2.986175 -0.000401
