program: Gaussian 09
title: 000216395
version: EM64L-G09RevD.01
frameworkgroup: C1[X(C4H5BrO2)]
method: RPBEPBE
basis: SDD
operation: Freq
keyword: #p
keyword: freq=noraman
keyword: PBEPBE/SDD
title: #p freq=noraman PBEPBE/SDD
converged: YES YES NO NO
title: Mulliken charges:
elementType: Br O O C C C C H H H H H
charge: -0.021766 -0.174330 -0.163957 -0.436569 -0.519175 -0.330164 0.238442 0.280887 0.252644 0.281618 0.274571 0.317800
chargesum: 0.00000
title: Mulliken charges with hydrogens summed into heavy atoms:
elementType: Br O O C C C C
charge: -0.021766 -0.174330 -0.163957 0.096963 0.037013 -0.012364 0.238442
polarizability: 8.45026182e+01 -1.26423786e+00 5.12525876e+01 -3.69954930e+00 2.86421359e+00 4.83899708e+01
1716.lowfreq: -14.0216 -0.0006 -0.0004 -0.0002 6.0736 14.1494 87.3018 134.5645 270.8954
frequency: 87.2972 134.5592 270.8948 285.3635 456.4806 510.4280 535.9406 632.4997 714.4511 751.8521 825.9170 907.9886 967.0005 1021.6458 1032.1624 1073.3210 1129.4835 1185.6312 1207.9767 1276.8788 1293.0419 1319.8349 1438.4422 1459.5062 1747.4609 3014.5201 3027.5520 3110.3943 3125.8336 3151.9350
redmass: 14.1636 2.8355 16.3375 2.6758 6.3496 2.5180 3.5452 7.5285 4.5399 5.9757 1.8534 3.9701 2.6186 2.0280 2.5504 3.7561 1.1662 1.3420 1.2265 1.2554 1.4604 1.4303 1.0779 1.0905 12.7874 1.0685 1.0638 1.0985 1.0979 1.0917
irintensity: 0.7350 5.9579 10.4435 5.2924 4.7922 2.5338 78.5862 24.1047 60.2599 45.6582 49.3637 112.5174 82.2173 49.5852 171.8044 57.3628 8.3887 35.4672 21.3434 13.8676 9.3939 2.9517 22.2253 18.8285 334.8268 12.5601 4.9025 2.8705 5.4241 4.1863
temp: 298.150 k
press: 1.00000 atm
elementType: 35 8 8 6 6 6 6 1 1 1 1 1
symmnumber: 1
zpe: 225473.9 jmol-1
zpe.correction: 0.085878 hartree
zpe.thermalcorrener: 0.092418 hartree
zpe.thermalcorrenthalpy: 0.093363 hartree
zpe.thermalcorrgfe: 0.053617 hartree
zpe.sumelectzpe: -318.794721 hartree
zpe.sumelectthermal: -318.788181 hartree
zpe.sumelectthermalent: -318.787237 hartree
zpe.sumelectthermalfe: -318.826982 hartree
dipole: 0.2665 4.7664 0.1303
dipole: 4.7756
quadrupole: -58.7432 -50.7030 -47.3414
quadrupole: -7.7768 0.5781 1.5274
quadrupole: -6.4807 1.5595 4.9212 -7.7768 0.5781 1.5274
hfenergy: -318.8805996 hartree
pointgroup: C01 [X(C4H5Br1O2)]
dipole: 0.5590606 1.7562145 0.3651589 debye
dipolederiv: -0.5576794 0.1497856 0.1935961 0.1720702 -0.258779 -0.1081333 0.4339386 -0.1603198 -0.3854425 -1.6928773 0.0948708 0.0092296 0.0996897 -0.4816448 0.1718208 -0.5057202 0.0940646 -0.4150985 -1.1886028 -0.1578294 -0.0978547 -0.3228026 -0.5148754 0.0017835 -0.1831222 0.0469296 -0.3215448 -0.0327038 0.0686865 -0.0351436 0.0032726 -0.1399727 0.0270289 0.1122758 -0.0276943 -0.0157391 -0.0667741 -0.1343605 -0.0304903 -0.0900185 -0.3010711 0.1465418 -0.0254682 0.1698603 0.0178326 1.4704621 -0.2722643 -0.4817352 0.1486057 0.5004814 0.1523414 -0.6524947 0.2593684 0.656979 1.9721097 0.1472182 0.2692967 -0.1232273 0.9241642 -0.2278993 0.7642219 -0.286364 0.4139705 -0.0035628 -0.0856249 0.0306197 -0.080209 0.0595097 0.0230049 0.0479784 0.0491982 0.0858336 0.0455027 0.0839049 0.0562549 0.0620309 0.0224054 -0.0938795 -0.0052038 -0.0631896 -0.0562534 0.09115 -0.0210079 0.0428066 -0.0078443 0.1119288 -0.0400587 -0.0045034 -0.0296343 -0.0237942 0.006067 0.0835554 -0.000725 0.0740148 0.0360052 -0.003986 -0.0024286 -0.0345528 0.1215303 -0.0430913 0.0430657 0.0441451 0.0644179 0.0418483 -0.0485645 0.0205265 -0.0176662 -0.0782734 unknown
polarizability: 80.5002735|-6.5396922|51.5427067|-9.0410846|5.2671515|52.1021963 unknown
InChI: InChI=1S/C4H5BrO2/c5-3-1-2-4(6)7-3/h3H,1-2H2
charge 0 multiplicity 1
12 atoms
Br 2.346533 -0.775289 -0.819267
O  -0.132278 -0.862344 0.678489
O  -2.268135 -0.678979 -0.251603
C  0.65991 1.371877 0.359568
C  -0.594984 1.181824 -0.518727
C  1.080336 -0.079761 0.660891
C  -1.161959 -0.169248 -0.075711
H  1.460486 1.951609 -0.119619
H  0.390682 1.861982 1.314516
H  -0.334564 1.108068 -1.590458
H  -1.358316 1.966066 -0.404724
H  1.64289 -0.266506 1.582742
