program: Gaussian 09
title: 000211129
version: EM64L-G09RevD.01
frameworkgroup: C1[X(C12H18NO3PS)]
method: RPBEPBE
basis: SDD
operation: Freq
keyword: #p
keyword: freq=noraman
keyword: PBEPBE/SDD
title: #p freq=noraman PBEPBE/SDD
converged: NO YES NO NO
title: Mulliken charges:
elementType: S P O O O N C C C C C C C C C C C C H H H H H H H H H H H H H H H H H H
charge: -0.232509 0.509586 -0.515518 -0.216837 -0.219818 0.020462 -0.309560 -0.324384 -0.661793 -0.659224 -0.647546 -0.660511 0.397313 -0.275834 -0.355252 -0.363452 -0.337619 0.384762 0.270823 0.271092 0.229263 0.234450 0.248759 0.227280 0.252477 0.221949 0.220654 0.245759 0.242120 0.231507 0.246151 0.220341 0.272511 0.259066 0.286226 0.287307
chargesum: 0.00000
title: Mulliken charges with hydrogens summed into heavy atoms:
elementType: S P O O O N C C C C C C C C C C C C
charge: -0.232509 0.509586 -0.515518 -0.216837 -0.219818 0.020462 -0.038737 -0.053292 0.050680 0.042482 0.060987 0.037487 0.397313 -0.003323 -0.096186 -0.077226 -0.050312 0.384762
polarizability: 2.82890439e+02 1.07267624e-01 1.64137745e+02 -5.96109380e+00 2.11470602e+01 1.68268374e+02
1716.lowfreq: -11.1906 -8.6462 -3.6242 0.0003 0.0007 0.0012 10.2138 26.0071 44.5039
frequency: 7.0212 25.7424 44.3220 57.9376 63.1514 75.6922 101.4777 109.2338 127.5480 139.5040 165.6912 193.2248 212.3553 213.8605 218.9883 240.2538 252.9133 261.3078 277.6983 300.8130 311.1098 350.9339 370.0295 407.1778 414.6314 416.6036 456.8131 471.3413 500.0834 518.7040 551.0739 620.6715 623.3790 650.6486 660.6028 665.0421 732.2867 773.0949 823.0607 835.3696 854.5658 879.6197 881.5529 926.5353 929.9565 961.4049 963.3662 976.1474 984.1065 995.6247 1052.9025 1058.4832 1095.0267 1106.0291 1108.2084 1123.8329 1165.9351 1167.5101 1167.9698 1216.0319 1225.4675 1249.8510 1260.0748 1287.0895 1287.9051 1292.3427 1352.9253 1380.8310 1384.3672 1394.3863 1399.4047 1401.9314 1428.7995 1463.9910 1465.5657 1468.5871 1471.1329 1472.4306 1478.9447 1481.7572 1488.1638 1490.4079 1586.3321 1600.3549 2980.1632 2982.4990 2985.5591 2985.6321 3004.6623 3021.0442 3075.1253 3076.1697 3080.8940 3081.8755 3085.6273 3088.4331 3096.0311 3096.8288 3166.5737 3173.0291 3187.2364 3190.5881
redmass: 5.1172 5.2641 2.7217 3.7132 4.7245 5.9627 4.1434 5.4106 5.8079 5.1105 5.9853 5.8371 1.7710 1.4449 1.0905 1.2159 1.5773 2.2355 2.2923 4.3895 5.8084 4.3448 2.6073 2.5204 4.8304 3.4707 3.4472 5.6296 4.0992 5.2836 5.4579 5.7099 6.7085 8.6241 5.9290 4.4972 5.0294 9.8862 1.2685 6.5363 1.6592 2.6419 2.6076 1.1493 1.1489 1.3576 1.3620 1.3325 1.3434 2.9320 1.3416 1.3205 3.2070 1.5048 1.9781 2.5321 1.4243 1.8930 1.9122 3.4551 6.2969 1.3136 1.3021 1.3642 1.2950 1.3983 7.5257 1.1869 1.1861 7.9535 1.2070 1.1890 4.4347 1.0445 1.0461 1.0544 2.2717 1.0617 1.0471 1.0434 1.0489 1.0489 7.9539 6.5393 1.0353 1.0350 1.0360 1.0354 1.0829 1.0846 1.0995 1.0995 1.0996 1.1003 1.0997 1.1010 1.1003 1.0998 1.0890 1.0890 1.0964 1.0974
irintensity: 0.0642 0.1033 0.2530 0.5173 0.1081 0.4348 0.9920 1.6219 1.0905 1.2338 4.7697 14.3858 3.0431 2.1483 0.3195 0.6367 1.2813 2.9937 0.4634 1.7402 1.2337 7.0358 6.8614 5.2780 6.6941 4.8475 6.7465 6.5022 7.9901 19.7098 54.3734 13.6802 26.0939 112.9702 57.7466 20.0388 6.5382 7.1413 5.8958 160.2580 63.1799 9.5985 4.2170 6.8167 10.1201 0.3512 0.3908 4.4540 0.1722 3.8994 50.3321 12.6744 21.0362 20.0930 7.7356 4.8566 279.8508 1.8509 13.9899 586.2867 173.4446 15.0748 6.9930 1.3144 0.4438 0.3498 81.0529 21.0336 16.1700 42.6828 26.2905 9.8231 19.0020 2.1582 8.1633 1.8569 107.5199 14.6678 27.1797 13.1357 22.4057 16.5059 32.2573 234.1723 28.5402 22.5133 29.0163 19.6656 5.8866 5.2312 38.0143 6.6876 29.0100 8.0364 26.2340 10.2077 19.3686 27.4362 1.7646 0.6016 0.8603 3.4666
temp: 298.150 k
press: 1.00000 atm
elementType: 16 15 8 8 8 7 6 6 6 6 6 6 6 6 6 6 6 6 1 1 1 1 1 1 1 1 1 1 1 1 1 1 1 1 1 1
symmnumber: 1
zpe: 741847.5 jmol-1
zpe.correction: 0.282555 hartree
zpe.thermalcorrener: 0.303409 hartree
zpe.thermalcorrenthalpy: 0.304354 hartree
zpe.thermalcorrgfe: 0.230282 hartree
zpe.sumelectzpe: -1486.345025 hartree
zpe.sumelectthermal: -1486.324170 hartree
zpe.sumelectthermalent: -1486.323226 hartree
zpe.sumelectthermalfe: -1486.397298 hartree
dipole: 8.9381 0.0045 -3.8142
dipole: 9.7179
quadrupole: -150.3355 -114.6788 -128.5434
quadrupole: -0.0716 -4.2817 -0.0279
quadrupole: -19.1496 16.5071 2.6425 -0.0716 -4.2817 -0.0279
hfenergy: -1486.6275795 hartree
pointgroup: C01 [X(C12H18N1O3P1S1)]
dipole: 3.482894 0.7110025 1.4077394 debye
polarizability: 275.4156761|29.9239735|166.6426018|-1.7544588|20.1969835|173.23828 unknown
InChI: InChI=1S/C12H18NO3PS/c1-9(2)17(18,10(3)4)16-12-7-5-11(6-8-12)13(14)15/h5-10H,1-4H3
charge 0 multiplicity 1
36 atoms
S  1.951149 0.437243 -2.47251
P  2.316224 0.478874 -0.425133
O  0.898808 0.342644 0.703565
O  -4.761944 -2.020803 -1.111264
O  -5.371129 -0.701679 0.649116
N  -4.484305 -1.196937 -0.153144
C  3.405043 -0.945174 0.225815
C  2.946149 2.147729 0.230652
C  2.799829 -2.301338 -0.192188
C  3.626722 -0.834294 1.749224
C  1.980407 3.266421 -0.208901
C  4.390534 2.383076 -0.263191
C  -0.404659 -0.051447 0.402739
C  -0.743441 -0.95401 -0.641106
C  -1.411226 0.478835 1.254709
C  -2.087432 -1.324849 -0.823534
C  -2.750894 0.100313 1.080087
C  -3.076758 -0.799402 0.037616
H  4.361005 -0.794257 -0.314177
H  2.918768 2.037768 1.331143
H  3.507962 -3.110774 0.062371
H  1.854523 -2.497224 0.345407
H  2.607276 -2.34053 -1.279058
H  4.246628 -1.685321 2.086729
H  2.66589 -0.875033 2.29064
H  4.15174 0.094251 2.036736
H  2.344231 4.235878 0.178243
H  1.927362 3.327494 -1.310747
H  0.960683 3.099696 0.179018
H  4.744527 3.363632 0.103862
H  4.429213 2.398084 -1.36752
H  5.096301 1.614249 0.101308
H  0.029547 -1.33888 -1.310344
H  -1.116367 1.175024 2.04496
H  -2.382218 -2.013942 -1.61912
H  -3.54505 0.486581 1.723998
