program: Gaussian 09
title: 000211125
version: EM64L-G09RevD.01
frameworkgroup: C1[X(C14H21N3OS)]
method: RPBEPBE
basis: SDD
operation: Freq
keyword: #p
keyword: freq=noraman
keyword: PBEPBE/SDD
title: #p freq=noraman PBEPBE/SDD
converged: YES YES NO NO
title: Mulliken charges:
elementType: S O N N N C C C C C C C C C C C C C C H H H H H H H H H H H H H H H H H H H H H
charge: 0.308649 -0.341927 -0.161832 -0.602129 -0.417688 -0.460393 -0.466997 -0.345694 -0.397390 0.326384 0.534235 -0.337655 -0.609552 -0.355271 -0.387525 -0.649890 -0.226504 -0.214842 -0.266587 0.295830 0.239105 0.247234 0.240025 0.292920 0.235630 0.228455 0.308597 0.207005 0.260546 0.227856 0.229267 0.263541 0.245632 0.242580 0.231237 0.199360 0.215348 0.219532 0.218267 0.224639
chargesum: 0.00000
title: Mulliken charges with hydrogens summed into heavy atoms:
elementType: S O N N N C C C C C C C C C C C C C C
charge: 0.308649 -0.341927 -0.161832 -0.602129 -0.109091 -0.164563 0.019342 0.187251 0.066695 0.326384 0.534235 0.129896 0.111113 -0.109640 -0.144945 -0.003945 -0.006972 0.003426 -0.041948
polarizability: 2.48208128e+02 -1.04895158e+01 1.99676178e+02 -2.43804364e+01 3.43286785e+00 1.34433894e+02
1716.lowfreq: -18.6435 -9.6261 -7.1964 0.0007 0.0016 0.0020 15.1603 19.6297 29.5102
frequency: 15.0893 19.1596 29.3265 34.6689 43.1486 77.5758 84.4953 123.5233 143.9201 154.9015 167.6027 195.1036 207.4082 217.6075 228.3861 252.1596 292.3235 325.6661 331.6533 335.4831 367.1235 412.5930 414.0947 438.0685 461.6175 488.9888 510.6426 518.2627 520.0444 613.4530 653.2485 693.9515 694.6372 706.1493 730.5959 757.2150 776.7156 823.1714 829.6252 833.8688 861.7901 884.3175 889.3637 906.7650 946.9385 961.1158 976.2971 977.0401 978.8984 1016.9785 1025.1904 1052.3390 1068.0263 1071.5645 1083.8929 1089.4907 1114.4486 1132.0732 1146.6678 1159.6295 1162.7249 1170.5837 1179.0283 1192.4626 1194.0422 1198.7762 1228.3253 1264.9309 1286.8199 1297.9806 1303.2241 1320.4870 1325.6862 1335.5200 1348.0510 1372.1529 1380.1988 1383.2962 1436.8563 1446.2526 1460.7233 1461.8405 1469.4111 1474.9405 1477.8975 1478.7861 1484.4765 1487.8630 1493.1364 1507.0006 1578.5377 1600.0986 1612.7216 2950.6960 2953.7639 2960.8038 2977.7264 2988.1648 2993.4243 3007.4997 3032.5768 3063.3990 3067.3162 3080.5808 3081.5475 3086.9510 3093.0938 3114.9794 3121.7993 3129.5618 3149.4773 3161.4063 3175.5496 3565.7970
redmass: 4.2306 3.7770 3.6467 3.3272 3.8922 4.8427 4.9835 3.4609 2.9971 2.6135 2.7844 1.3999 3.6643 3.8830 1.3908 2.4602 3.1785 3.0450 2.8259 3.6347 2.8802 2.9747 2.8241 2.6536 1.7532 5.4414 2.9236 4.5622 3.9470 6.3653 6.1363 2.4042 2.1821 9.9946 3.0396 1.7772 1.9458 1.2628 1.8088 3.7400 2.1155 1.4840 2.2221 2.5964 1.7894 1.3661 2.3820 1.9980 1.6240 3.2703 2.3995 1.5342 2.5985 2.1258 1.9452 1.6927 1.2660 1.6009 1.6271 1.3067 1.3527 1.1141 2.7175 1.9796 1.1438 1.7942 1.3808 1.4535 1.1565 2.7969 1.4497 1.3794 1.6101 1.5048 1.5868 1.7841 6.3493 1.2222 1.3953 1.8314 1.1306 1.0850 1.0516 1.0552 1.0876 1.1891 1.6282 1.2670 1.0947 1.7738 6.2166 5.5814 6.1406 1.0568 1.0375 1.0713 1.0358 1.0669 1.0947 1.0725 1.1025 1.0977 1.1031 1.0893 1.0966 1.0900 1.1014 1.0956 1.0846 1.0889 1.0925 1.0972 1.0959 1.0769
irintensity: 0.1675 0.5501 1.0708 1.1637 0.0364 6.3826 7.8793 1.3424 3.9579 2.7293 1.2069 4.7894 1.8072 1.0616 4.2618 0.9894 6.9395 19.2913 1.4827 0.4962 1.6357 1.7124 11.0631 38.8105 65.5165 2.5523 8.4914 6.7693 6.9485 0.2913 1.9122 11.6916 26.5152 17.0743 4.5590 80.8938 9.2552 0.5896 0.9407 53.4883 4.0742 8.0419 6.1576 8.5282 2.1336 0.0767 17.0048 0.9608 1.2530 6.3984 19.4600 5.7150 9.5062 0.9971 9.9370 26.3159 2.8096 4.4588 1.3950 3.6036 1.9996 1.2180 68.0297 42.3035 9.5466 7.1431 41.0025 27.9303 21.1909 88.4758 27.3622 2.2285 43.4248 103.1510 21.2690 86.5917 13.0123 22.8907 0.8846 3.6180 61.7118 24.3014 13.8503 19.5600 31.8041 109.8028 171.6534 66.1629 29.1119 255.3406 6.0946 198.6394 152.7471 58.7089 44.0852 34.6979 29.0402 66.9249 15.3990 64.3309 26.1262 14.4288 18.3484 29.9190 39.6971 1.5135 36.7664 14.1585 5.7894 15.0311 23.1429 32.8904 8.1543 8.4220
temp: 298.150 k
press: 1.00000 atm
elementType: 16 8 7 7 7 6 6 6 6 6 6 6 6 6 6 6 6 6 6 1 1 1 1 1 1 1 1 1 1 1 1 1 1 1 1 1 1 1 1 1
symmnumber: 1
zpe: 873495.5 jmol-1
zpe.correction: 0.332697 hartree
zpe.thermalcorrener: 0.352791 hartree
zpe.thermalcorrenthalpy: 0.353735 hartree
zpe.thermalcorrgfe: 0.280698 hartree
zpe.sumelectzpe: -1182.172491 hartree
zpe.sumelectthermal: -1182.152396 hartree
zpe.sumelectthermalent: -1182.151452 hartree
zpe.sumelectthermalfe: -1182.224489 hartree
dipole: -3.3568 3.4014 1.1806
dipole: 4.9226
quadrupole: -110.7391 -110.9170 -129.0217
quadrupole: -5.1257 -9.4735 -6.0686
quadrupole: 6.1535 5.9756 -12.1291 -5.1257 -9.4735 -6.0686
hfenergy: -1182.5051875 hartree
pointgroup: C01 [X(C14H21N3O1S1)]
dipole: -1.2690289 -1.4003335 -0.4235319 debye
polarizability: 247.5469217|12.9789265|200.7554509|23.3339569|2.6869653|134.0158277 unknown
InChI: InChI=1S/C14H21N3OS/c1-3-15-14(18)17-10-9-13(11-17)19-16(2)12-7-5-4-6-8-12/h4-8,13,15H,3,9-11H2,1-2H3
charge 0 multiplicity 1
40 atoms
S  0.692839 -1.420349 -1.318703
O  -2.185739 1.235661 1.379548
N  -1.890067 -1.011958 0.81093
N  1.209099 0.243862 -0.966699
N  -3.926344 0.076986 0.320007
C  0.165087 -2.111123 0.423144
C  -0.975973 -3.123222 0.16449
C  -0.491971 -1.033052 1.290987
C  -2.248559 -2.237844 0.060583
C  -2.642102 0.160316 0.865371
C  2.48894 0.521224 -0.424461
C  -4.814663 1.248504 0.277306
C  0.250007 1.333752 -1.237451
C  2.839948 1.861845 -0.076597
C  3.453874 -0.507036 -0.209838
C  -4.97086 1.839649 -1.140751
C  4.112671 2.149306 0.46101
C  4.720403 -0.201313 0.32603
C  5.065836 1.127532 0.668627
H  1.062463 -2.551368 0.884443
H  -1.04855 -3.810107 1.028361
H  -0.822481 -3.738034 -0.74011
H  -0.434687 -1.320855 2.361764
H  -0.031151 -0.037451 1.192777
H  -2.473426 -1.997241 -0.998966
H  -3.126417 -2.754124 0.498967
H  -4.257948 -0.798291 -0.084586
H  -5.805974 0.970122 0.686112
H  -4.368498 1.99737 0.953278
H  -0.626533 0.910239 -1.749891
H  0.707299 2.096013 -1.898133
H  -0.104027 1.820869 -0.307157
H  2.123473 2.676099 -0.212296
H  3.207311 -1.537003 -0.487323
H  -3.991522 2.169911 -1.529454
H  -5.393037 1.099255 -1.846128
H  -5.648001 2.713851 -1.120679
H  4.355162 3.186091 0.722666
H  5.444655 -1.011216 0.47355
H  6.050763 1.358831 1.087274
