program: Gaussian 09
title: 000211112
version: EM64L-G09RevD.01
frameworkgroup: C1[X(C15H23NO2)]
method: RPBEPBE
basis: SDD
operation: Freq
keyword: #p
keyword: freq=noraman
keyword: PBEPBE/SDD
title: #p freq=noraman PBEPBE/SDD
converged: YES YES NO NO
title: Mulliken charges:
elementType: O O N C C C C C C C C C C C C C C C H H H H H H H H H H H H H H H H H H H H H H H
charge: -0.282576 -0.242556 -0.132718 -0.376697 -0.306902 -0.322258 -0.350995 -0.673491 -0.675515 0.211848 0.122059 -0.341633 0.134090 -0.321037 -0.441915 -0.252552 -0.257056 -0.692118 0.252455 0.213569 0.185851 0.206485 0.189534 0.217923 0.233644 0.226853 0.212437 0.224064 0.216422 0.213468 0.226395 0.211806 0.294137 0.283992 0.236499 0.237836 0.228755 0.231514 0.228007 0.203505 0.226869
chargesum: 0.00000
title: Mulliken charges with hydrogens summed into heavy atoms:
elementType: O O N C C C C C C C C C C C C C C C
charge: -0.282576 -0.242556 -0.132718 0.089327 0.085434 0.085200 0.109502 -0.020568 -0.023845 0.211848 0.122059 -0.047496 0.134090 -0.037045 0.032420 -0.023797 -0.025542 -0.033737
polarizability: 2.25571471e+02 -1.64081305e+00 1.92961655e+02 1.00081119e+01 -2.19588462e+00 1.21237790e+02
1716.lowfreq: -5.2194 -0.0007 -0.0004 0.0005 7.5597 9.6597 18.4356 22.8167 32.7565
frequency: 16.8461 22.2195 32.6850 47.5645 65.7017 78.8521 98.7593 107.5248 124.8531 142.2448 178.1079 189.5314 202.6578 221.2694 225.7812 270.3602 282.5641 286.3656 302.6837 320.2268 336.8403 407.5988 422.0401 437.5869 465.5792 488.7483 510.1907 523.6844 567.7646 589.3669 625.4330 705.8602 729.5399 733.2571 770.9433 773.9124 792.3873 798.3898 806.3592 851.9106 896.8060 912.7730 948.2708 960.1058 983.9022 1000.6444 1001.0492 1020.8901 1028.5530 1048.0678 1065.7157 1068.4281 1073.1854 1075.5716 1077.9108 1088.6626 1117.0177 1120.7121 1163.4715 1177.5612 1190.6559 1199.4974 1212.0821 1239.6579 1254.7241 1260.6094 1282.1663 1285.4190 1291.0224 1337.6364 1343.4013 1363.4817 1367.3386 1378.3298 1379.1598 1390.6413 1391.7249 1394.2644 1409.2843 1430.4812 1462.0127 1465.3433 1466.5362 1468.1160 1471.4791 1474.7820 1476.5316 1478.3134 1479.9222 1485.0857 1492.5150 1560.6986 1579.9098 1609.6733 2856.5536 2862.5277 2877.9179 2987.4309 2988.1012 2988.5379 2993.2614 2997.5083 3023.2590 3028.9221 3043.6052 3062.8696 3080.4228 3082.1891 3087.4884 3092.7180 3093.0671 3093.6978 3096.3959 3106.2869 3132.9307 3146.9054 3165.5558
redmass: 3.5130 4.0987 4.6588 3.8287 2.3761 1.9194 2.4706 2.5184 2.5709 3.0019 1.6432 1.3340 1.8982 2.1052 2.0951 2.6508 2.1640 2.1748 2.5031 4.0248 4.8462 4.0046 3.2191 3.1624 2.7789 2.9136 5.7097 3.2828 2.3871 4.6847 5.3356 3.4701 3.0886 3.2045 3.1736 1.2752 1.2372 1.1604 1.5581 1.9877 1.3538 2.1378 3.9283 3.7680 1.3282 1.3959 1.9191 1.7532 3.3080 2.1535 2.0319 1.6894 2.0088 2.5336 2.5752 2.1170 1.9713 1.9981 1.8838 1.1438 2.9477 2.3147 2.0699 1.1778 1.2470 1.1584 1.1921 1.4665 1.2191 1.3170 1.8665 1.3211 1.2936 1.5861 4.6671 1.2265 1.2212 1.2242 1.1351 2.2322 1.0867 1.0522 1.0403 1.0607 1.1147 1.0627 1.2113 1.5502 1.0733 1.0667 1.0760 6.8030 7.0426 6.1966 1.0723 1.0722 1.0714 1.0574 1.0360 1.0361 1.0408 1.0638 1.0869 1.0964 1.0874 1.0868 1.0986 1.0979 1.0998 1.1011 1.1007 1.1002 1.0995 1.0920 1.0889 1.0916 1.0996
irintensity: 0.5781 1.9199 1.2475 1.0927 0.2272 0.8378 0.0394 1.2503 0.7418 0.1247 1.4498 0.4479 0.6599 0.9811 1.8104 3.4801 0.7051 0.1231 4.4093 11.2144 5.1109 3.6801 2.4671 3.2705 5.3419 8.2527 4.6819 2.3805 0.3340 5.1742 8.4024 1.3449 10.1320 5.8713 4.7843 96.3975 7.6235 3.9432 0.2899 5.5394 4.2467 6.4008 54.1520 50.3987 7.4560 3.3587 29.1691 10.1400 12.2214 8.9351 17.8912 1.0434 15.5127 20.2564 10.3378 10.3759 14.9517 16.0556 18.5065 22.6288 156.3929 54.4858 54.8285 0.2010 42.2367 1.3736 13.1837 48.0676 24.6163 7.7131 50.5908 0.9313 3.9807 0.5423 16.6090 24.3258 26.8686 16.9332 31.9866 51.8002 9.3885 8.3574 10.5491 9.4340 15.7558 5.7898 9.6619 65.8057 15.3608 16.6986 21.3115 72.4175 76.9369 71.9932 25.7184 92.0700 189.3809 42.6682 28.9792 18.1558 20.0775 34.5812 22.1985 5.3343 13.6490 15.7620 35.9963 71.4650 27.5941 24.3262 51.9884 32.5376 35.0914 27.1227 2.9069 3.2059 29.8875
temp: 298.150 k
press: 1.00000 atm
elementType: 8 8 7 6 6 6 6 6 6 6 6 6 6 6 6 6 6 6 1 1 1 1 1 1 1 1 1 1 1 1 1 1 1 1 1 1 1 1 1 1 1
symmnumber: 1
zpe: 918996.0 jmol-1
zpe.correction: 0.350027 hartree
zpe.thermalcorrener: 0.370048 hartree
zpe.thermalcorrenthalpy: 0.370992 hartree
zpe.thermalcorrgfe: 0.299110 hartree
zpe.sumelectzpe: -789.164092 hartree
zpe.sumelectthermal: -789.144071 hartree
zpe.sumelectthermalent: -789.143127 hartree
zpe.sumelectthermalfe: -789.215010 hartree
dipole: -6.5962 -1.3871 -0.0563
dipole: 6.7407
quadrupole: -123.2734 -101.3187 -109.7546
quadrupole: 0.3011 -1.6084 0.6028
quadrupole: -11.8245 10.1302 1.6943 0.3011 -1.6084 0.6028
hfenergy: -789.5141192 hartree
pointgroup: C01 [X(C15H23N1O2)]
dipole: -2.2576708 -1.1193141 -0.8265275 debye
polarizability: 197.3962623|36.6639079|148.3710713|2.4448599|29.2707651|194.0035824 unknown
InChI: InChI=1S/C15H23NO2/c1-4-14(17)13-9-7-8-10-15(13)18-12-11-16(5-2)6-3/h7-10H,4-6,11-12H2,1-3H3
charge 0 multiplicity 1
41 atoms
O  -0.129365 0.283187 1.13034
O  3.474488 2.412591 1.88511
N  -2.663766 -0.830258 -1.243173
C  -2.32158 0.080543 -0.117517
C  -3.294098 -0.094954 -2.380804
C  -3.514795 -1.969021 -0.780275
C  -1.316945 -0.563158 0.875562
C  -2.302403 0.7636 -3.187382
C  -3.488306 -3.175194 -1.737127
C  0.879635 0.342688 0.153869
C  2.071005 1.073642 0.471393
C  0.737691 -0.297555 -1.106478
C  2.362405 1.81145 1.75984
C  3.097366 1.117221 -0.514862
C  1.348134 1.844566 2.90148
C  1.780615 -0.230051 -2.051806
C  2.970799 0.477145 -1.759413
C  1.831278 2.654659 4.115481
H  -1.854505 0.990199 -0.531423
H  -3.236229 0.414174 0.431944
H  -4.141298 0.542644 -2.019854
H  -3.734659 -0.847412 -3.058337
H  -4.570955 -1.636529 -0.612281
H  -3.133464 -2.299375 0.204128
H  -1.75102 -0.678166 1.881629
H  -0.991489 -1.552989 0.501682
H  -2.825652 1.251308 -4.030549
H  -1.491151 0.136342 -3.595716
H  -1.84001 1.561576 -2.579789
H  -4.081765 -4.008315 -1.31742
H  -2.450514 -3.521264 -1.885434
H  -3.912184 -2.933727 -2.727988
H  -0.190907 -0.821806 -1.362606
H  4.000247 1.678106 -0.250738
H  0.391234 2.238656 2.506434
H  1.108033 0.799785 3.181143
H  1.656974 -0.728636 -3.020207
H  3.781075 0.529856 -2.493622
H  2.76945 2.239775 4.522603
H  1.065313 2.645218 4.912328
H  2.03832 3.702479 3.837336
