program: Gaussian 09
title: 000216385
version: EM64L-G09RevD.01
frameworkgroup: C1[X(C15H16O6S)]
method: RPBEPBE
basis: SDD
operation: Freq
keyword: #p
keyword: freq=noraman
keyword: PBEPBE/SDD
title: #p freq=noraman PBEPBE/SDD
converged: NO YES NO NO
title: Mulliken charges:
elementType: S O O O O O O C C C C C C C C C C C C C C C H H H H H H H H H H H H H H H H
charge: 0.288984 -0.293694 -0.443068 -0.435358 -0.439910 -0.252136 -0.194876 -0.111800 -0.169526 -0.070206 -0.527457 -0.730431 0.464716 -0.503875 0.233429 -0.435578 0.198704 -0.355042 0.406994 -0.478391 -0.808073 0.126359 0.256561 0.274176 0.254502 0.316034 0.274918 0.288260 0.366606 0.363203 0.362038 0.280724 0.260277 0.249960 0.255838 0.242033 0.241959 0.243147
chargesum: 0.00000
title: Mulliken charges with hydrogens summed into heavy atoms:
elementType: S O O O O O O C C C C C C C C C C C C C C C
charge: 0.288984 -0.293694 -0.076462 -0.072155 -0.077872 -0.252136 -0.194876 0.144761 0.104650 0.184296 -0.211423 -0.167254 0.464716 -0.223152 0.233429 -0.175300 0.198704 -0.105081 0.406994 -0.222553 -0.080934 0.126359
polarizability: 3.13833811e+02 -2.40392584e+01 2.06461437e+02 -8.31255955e+00 -2.84498903e+00 1.24269728e+02
1716.lowfreq: -26.0817 -12.7788 -4.9307 -0.0023 -0.0020 0.0014 8.0457 23.1045 39.1236
frequency: -18.4460 21.4718 39.0839 82.5926 88.9045 98.2574 119.2465 156.6375 161.1292 181.7211 196.8227 202.5136 217.9970 231.8148 244.4426 263.8144 279.1436 302.4754 317.6364 324.6290 345.8865 386.3851 414.1226 429.9191 443.4578 455.6363 492.0980 504.7384 510.0890 516.5668 538.1994 545.0629 546.3627 556.8519 616.7516 621.9848 661.7762 668.8959 685.4619 718.5519 742.3689 764.2212 779.1011 783.4807 814.0863 822.4488 854.3706 873.4356 875.5412 891.6748 939.7106 958.2945 961.9167 982.6962 995.5388 997.3028 1012.0133 1045.5150 1047.6981 1053.3356 1110.1996 1114.9059 1132.0485 1160.3778 1162.7490 1195.7665 1214.5213 1223.5301 1226.4968 1247.4073 1258.9454 1263.4644 1273.0259 1287.9565 1299.3101 1334.4088 1349.7691 1372.3956 1380.3401 1383.3546 1385.3815 1398.7885 1400.6548 1426.1997 1427.3875 1466.2294 1469.0081 1496.3764 1552.7827 1609.0879 1615.6664 1691.6101 2970.1031 2981.8885 3033.0996 3036.2493 3050.6273 3058.9151 3067.7309 3104.2747 3117.6466 3154.3370 3172.7662 3174.9403 3179.3941 3450.7071 3453.3516 3565.6212
redmass: 6.0342 5.8827 6.0705 7.1564 4.6704 6.1777 4.7917 6.7072 1.4137 3.6848 3.0319 2.6713 4.8214 1.5629 5.6720 5.1878 4.4096 4.2416 5.9486 5.6401 3.4126 5.6120 6.3064 4.7586 3.6569 4.7053 1.5094 2.9927 3.5730 1.7260 3.4586 3.9002 5.8173 4.8172 4.6403 4.2569 7.3040 3.7835 5.6771 5.4013 3.4753 6.7545 3.4510 6.2002 2.5418 1.4965 1.7132 4.8419 1.4292 3.4493 2.7444 1.3326 3.4932 4.7707 1.8653 4.8514 2.8375 1.5845 2.6459 3.3069 1.7857 2.4713 2.0541 1.1507 1.5643 1.1326 1.6459 1.4553 1.9357 1.4391 1.3690 1.3652 1.5653 1.3181 1.3456 1.3812 1.3055 1.3992 1.8294 1.4889 3.2507 1.3404 1.4475 1.0965 5.2246 1.0479 1.1022 3.4536 7.2074 7.4831 7.0495 10.5276 1.0844 1.0382 1.0780 1.0704 1.0826 1.0970 1.0864 1.0985 1.1062 1.0882 1.0920 1.0921 1.0966 1.0654 1.0663 1.0663
irintensity: 0.3555 3.1871 0.3479 1.1283 8.5061 3.2561 25.0870 3.3378 0.0372 1.7735 20.6381 6.7567 5.5124 128.4722 3.3597 0.7086 1.5304 2.6874 12.6656 28.5752 3.3708 4.5777 4.0895 4.4196 6.4672 17.7522 99.6162 53.4291 13.4574 43.5610 17.1421 3.4090 1.8949 6.9140 13.1515 12.9047 3.2869 6.4469 52.5175 18.3812 1.1567 8.7361 16.1268 65.6784 9.9414 21.4944 59.5071 224.9662 54.6632 2.6416 18.1596 0.6668 168.5982 36.9246 21.5623 124.8323 50.2504 8.7004 73.1525 54.4512 6.5037 108.5344 84.4160 5.1341 78.0214 22.7219 34.7943 15.3791 78.8794 71.4334 34.4264 15.2573 41.7824 1.0702 3.0450 6.4062 10.4589 19.3003 187.9630 3.3056 8.1545 18.5401 80.4144 24.0025 18.9571 17.0347 10.4389 28.2259 21.3007 89.4940 444.0576 520.9358 41.7160 11.0620 9.4999 30.0285 28.7707 11.7543 0.9871 21.0308 3.9966 5.6040 1.4904 3.2312 4.2183 28.8878 150.5569 15.7380
temp: 298.150 k
press: 1.00000 atm
elementType: 16 8 8 8 8 8 8 6 6 6 6 6 6 6 6 6 6 6 6 6 6 6 1 1 1 1 1 1 1 1 1 1 1 1 1 1 1 1
symmnumber: 1
zpe: 752963.6 jmol-1
zpe.correction: 0.286789 hartree
zpe.thermalcorrener: 0.306652 hartree
zpe.thermalcorrenthalpy: 0.307596 hartree
zpe.thermalcorrgfe: 0.238736 hartree
zpe.sumelectzpe: -1428.949809 hartree
zpe.sumelectthermal: -1428.929946 hartree
zpe.sumelectthermalent: -1428.929001 hartree
zpe.sumelectthermalfe: -1428.997862 hartree
dipole: -1.4779 -4.7666 0.6120
dipole: 5.0279
quadrupole: -146.8783 -136.0484 -144.1843
quadrupole: 26.7056 -1.1255 5.2268
quadrupole: -4.5080 6.3219 -1.8139 26.7056 -1.1255 5.2268
hfenergy: -1429.2365975 hartree
pointgroup: C01 [X(C15H16O6S1)]
dipole: -0.5716559 -1.8283545 0.4932154 debye
polarizability: 313.8963195|-24.6954828|204.0940794|-6.527778|-13.4114591|126.5745771 unknown
InChI: InChI=1S/C15H16O6S/c1-7-4-12(17)21-11-5-8(2-3-9(7)11)20-15-14(19)13(18)10(16)6-22-15/h2-5,10,13-16,18-19H,6H2,1H3
charge 0 multiplicity 1
38 atoms
S  3.563377 -0.560711 -1.934559
O  1.424461 -0.920804 -0.259896
O  3.04355 -0.588194 2.027536
O  3.319094 2.260525 -0.458625
O  5.813418 0.907734 -0.053538
O  -2.741886 1.58289 -0.471667
O  -4.684987 2.829326 -0.541593
C  3.726319 0.427056 1.216295
C  2.720543 1.10691 0.241109
C  4.985002 -0.158537 0.511517
C  2.213597 0.183485 -0.888747
C  4.64177 -1.241416 -0.525983
C  0.019279 -0.817213 -0.205709
C  -0.689482 0.386662 -0.390498
C  -2.819023 -0.836828 -0.002094
C  -0.664035 -2.031529 0.077931
C  -2.096595 0.360301 -0.288109
C  -2.060008 -2.030488 0.178292
C  -4.274181 -0.767599 0.092534
C  -4.903206 0.450861 -0.08951
C  -5.076117 -2.015612 0.388116
C  -4.200496 1.694994 -0.376071
H  4.077392 1.18529 1.939781
H  1.841914 1.429816 0.839679
H  5.61061 -0.621605 1.294959
H  1.586201 0.751827 -1.594876
H  4.124452 -2.101022 -0.069161
H  5.559524 -1.587766 -1.026356
H  2.424348 -1.097621 1.435381
H  3.498767 2.97988 0.198937
H  5.247942 1.409416 -0.70499
H  -0.208575 1.347108 -0.592064
H  -0.081525 -2.948246 0.203199
H  -2.578356 -2.969807 0.393537
H  -5.990935 0.54052 -0.023119
H  -4.910913 -2.788488 -0.386002
H  -4.782678 -2.458062 1.358565
H  -6.154561 -1.794551 0.425596
