program: Gaussian 09
title: 000015155
version: EM64L-G09RevD.01
frameworkgroup: C1[X(C7H9NO2)]
method: RPBEPBE
basis: SDD
operation: Freq
keyword: #pfreq=noraman
keyword: PBEPBE/SDD
title: #p freq=noraman PBEPBE/SDD
converged: YES YES NO YES
title: Mulliken charges:
elementType: O O N C C C C C C C H H H H H H H H H
charge: -0.204941 -0.197713 -0.368099 0.297443 -0.522687 -0.522685 -0.432408 -0.605702 0.090704 0.159060 0.234560 0.252274 0.252331 0.234579 0.240268 0.216520 0.265129 0.265268 0.346099
chargesum: 0.00000
title: Mulliken charges with hydrogens summed into heavy atoms:
elementType: O O N C C C C C C C
charge: -0.204941 -0.197713 -0.022001 0.297443 -0.035854 -0.035774 0.024381 -0.075305 0.090704 0.159060
polarizability: 1.01022384e+02 -5.65170701e+00 8.47789055e+01 1.86438424e-03 1.70990637e-03 6.06510335e+01
1716.lowfreq: -20.3061 -0.0008 -0.0008 -0.0006 5.0618 10.8454 24.9175 95.2195 149.1091
frequency: 22.2238 95.2170 149.1085 202.0591 281.3343 328.6444 357.0502 436.0638 530.5953 570.6554 618.8318 650.3505 679.3481 727.2451 757.9173 800.4523 853.9857 872.8953 877.4152 924.8643 951.7370 953.9946 1025.4968 1062.7749 1076.4050 1169.0789 1170.2349 1189.8847 1191.6428 1240.3398 1243.2475 1255.8290 1256.3541 1274.4581 1302.3398 1323.4001 1437.1849 1448.3520 1460.2278 1476.4544 1661.0775 1698.6134 3017.8032 3018.6669 3019.5704 3029.3770 3074.2623 3086.1460 3095.4340 3111.4717 3546.0560
redmass: 3.1813 2.3376 9.3455 2.8137 2.9451 6.5579 2.0249 6.0310 2.7461 4.0327 7.8376 2.7945 3.0338 2.0883 1.4181 1.3473 2.5721 2.2693 2.7200 2.0592 2.4099 2.6614 2.2204 1.3466 3.3627 1.2703 2.4211 1.2584 2.3856 2.1373 1.2321 1.3936 2.8094 1.6778 2.5945 1.7707 1.0812 1.0813 1.0939 1.1119 7.6201 12.4119 1.0574 1.0607 1.0572 1.0650 1.1014 1.1070 1.1079 1.1072 1.0791
irintensity: 0.3404 0.1117 11.5126 0.0401 4.6949 12.4524 0.9751 15.3605 3.1253 2.6171 3.9015 10.0034 13.4458 18.2077 116.1872 4.4397 2.1935 3.7031 7.4302 1.3685 4.0867 5.0079 0.7543 0.7942 66.6234 0.5198 42.6471 0.9595 109.3166 59.3262 0.9244 3.9531 44.3259 9.7331 87.2584 14.4711 16.8722 12.1072 5.1294 3.1223 585.7869 95.0851 60.4628 8.9212 9.0938 32.8556 2.8612 7.0868 11.4815 50.9277 47.6128
temp: 298.150 k
press: 1.00000 atm
elementType: 8 8 7 6 6 6 6 6 6 6 1 1 1 1 1 1 1 1 1
symmnumber: 1
zpe: 398381.4 jmol-1
zpe.correction: 0.151735 hartree
zpe.thermalcorrener: 0.160524 hartree
zpe.thermalcorrenthalpy: 0.161468 hartree
zpe.thermalcorrgfe: 0.116742 hartree
zpe.sumelectzpe: -476.599330 hartree
zpe.sumelectthermal: -476.590542 hartree
zpe.sumelectthermalent: -476.589598 hartree
zpe.sumelectthermalfe: -476.634324 hartree
dipole: -2.1851 -1.4904 -0.0013
dipole: 2.6450
quadrupole: -66.1427 -64.7895 -56.7475
quadrupole: 9.6356 -0.0023 -0.0019
quadrupole: -3.5828 -2.2296 5.8124 9.6356 -0.0023 -0.0019
hfenergy: -476.7510658 hartree
pointgroup: C01 [X(C7H9N1O2)]
dipole: 0.8546461 0.5937156 -0.0007167 debye
dipolederiv: -0.6538576 0.1765575 0.000152 0.2442551 -1.064876 -0.0003425 -0.0006001 0.0008658 -0.3375465 -1.1841035 0.3429611 -0.0003566 0.2551297 -0.6316329 0.0001182 0.0007986 -0.00053 -0.3433203 -1.1774639 0.4980584 -0.0001682 0.5464241 -1.0339591 -0.000226 0.0000779 -0.000141 -0.3164932 -0.2569971 -0.2066531 0.0000366 -0.2817547 -0.1604147 0.0002003 -0.000404 -0.000184 0.0054232 0.076334 0.0229376 -0.0481871 -0.0395336 0.0736088 -0.0546268 0.0066817 -0.1074358 0.1068742 0.0764689 0.0230611 0.0482349 -0.0395052 0.0731833 0.0547106 -0.0066261 0.107449 0.1070524 0.1480604 -0.0754493 -0.0000551 -0.0311391 0.1280485 0.0000563 -0.0000958 0.0000727 -0.0328799 -0.2873658 -0.1528792 -0.0000095 -0.2232635 -0.1125968 -0.0001943 -0.0007109 -0.0005393 0.0836706 1.5836427 -0.4490027 -0.0001815 -0.0758361 1.216459 0.0001202 0.0003709 -0.000288 0.1605115 1.4002833 -0.2972367 0.0003888 -0.6167645 1.4499628 0.0001004 0.0000659 0.000527 0.201959 0.0218965 0.0197681 -0.0700568 0.0051393 0.0127024 0.1263958 -0.0202571 0.082822 -0.107642 0.0460826 0.0237131 0.0148287 0.0650493 -0.0577293 -0.0878125 0.0048094 -0.0358278 0.0473875 0.0461574 0.0237097 -0.0147725 0.0651199 -0.0576524 0.0876457 -0.0047089 0.0356901 0.0475674 0.0218836 0.0196185 0.0700064 0.0050836 0.012924 -0.1262989 0.0202469 -0.0827449 -0.1078041 -0.1951632 0.0159154 0.0000651 0.0790792 0.06411 -0.0000131 0.0001024 0.0000019 0.0738374 0.0631419 0.0141075 0.0000043 -0.0488906 -0.1663504 -0.0000904 -0.0000171 -0.0001196 0.0648929 0.0599209 -0.0109275 0.0101791 0.0292242 0.0444975 0.0636012 -0.0112924 0.1020588 -0.0054804 0.0597586 -0.0109002 -0.0101782 0.0292258 0.0448829 -0.0633738 0.0114406 -0.1018068 -0.0056645 0.1513202 0.0226406 0.0000696 0.0329568 0.1648324 0.0000296 0.0001182 0.0001298 0.3576546 unknown
polarizability: 101.1180533|-5.5116819|84.6832338|-0.0054156|-0.0059434|60.6510359 unknown
InChI: InChI=1S/C7H9NO2/c9-5-4-7(2-1-3-7)6(10)8-5/h8H,1-4H2
charge 0 multiplicity 1
19 atoms
O  0.326774 -2.315845 0.000777
O  -3.000057 0.993071 0.000624
N  -1.543734 -0.869516 -0.000018
C  0.598966 0.169385 -0.000215
C  1.733509 0.301848 -1.091386
C  1.733891 0.300883 1.09064
C  2.698993 0.875016 -0.000287
C  -0.503847 1.256509 0.000396
C  -0.161993 -1.161209 -0.00085
C  -1.845359 0.51012 -0.000545
H  1.498537 0.939426 -1.959702
H  2.053195 -0.69487 -1.440614
H  2.053715 -0.696147 1.438855
H  1.499289 0.937686 1.959629
H  3.732372 0.495269 -0.00065
H  2.722881 1.978572 0.000199
H  -0.465521 1.91384 -0.886459
H  -0.465827 1.912291 0.88843
H  -2.265482 -1.594829 0.000777
