program: Gaussian 09
title: 000211063
version: EM64L-G09RevD.01
frameworkgroup: C1[X(C4H5ClN2O4S3)]
method: RPBEPBE
basis: SDD
operation: Freq
keyword: #p
keyword: freq=noraman
keyword: PBEPBE/SDD
title: #p freq=noraman PBEPBE/SDD
converged: YES YES NO NO
title: Mulliken charges:
elementType: Cl S S S O O O O N N C C C C H H H H H
charge: 0.110846 0.960108 0.983073 0.482899 -0.510794 -0.521816 -0.511535 -0.508961 -0.708654 -0.700398 0.328135 -0.459288 -0.051108 -0.606719 0.343613 0.340811 0.347048 0.333457 0.349283
chargesum: 0.00000
title: Mulliken charges with hydrogens summed into heavy atoms:
elementType: Cl S S S O O O O N N C C C C
charge: 0.110846 0.960108 0.983073 0.482899 -0.510794 -0.521816 -0.511535 -0.508961 -0.020795 -0.017658 0.328135 -0.459288 0.292506 -0.606719
polarizability: 2.02555275e+02 6.62702397e+00 1.50374369e+02 -1.68221270e+00 5.37043503e-01 9.73593454e+01
1716.lowfreq: -5.7787 0.0021 0.0027 0.0034 3.6503 3.9912 21.7515 36.6640 71.6925
frequency: 21.7204 36.6295 71.6879 81.6672 98.0948 117.3250 121.2339 135.4548 176.2803 192.1782 197.0125 232.7794 255.1297 260.2259 274.6158 295.0819 313.3797 331.7852 354.8725 358.4362 406.7760 425.3846 456.7090 460.5319 515.3536 528.5134 611.8216 639.6457 725.0114 787.9521 791.8216 808.9785 810.4277 912.5812 914.0369 917.3546 927.9183 956.6773 1071.7937 1077.3546 1120.4678 1286.4292 1467.4747 1513.8683 1533.3460 1534.7922 3187.6794 3370.1890 3376.6793 3538.3480 3545.7629
redmass: 8.3367 7.9627 6.8871 11.5135 5.3834 13.4846 2.2330 2.1072 9.7989 2.8275 10.0958 6.9637 5.8555 3.3988 3.2449 3.5018 7.9969 8.6773 9.4891 13.7576 11.1145 14.3262 3.8641 3.6414 6.9836 6.4405 5.6899 10.4213 6.4027 1.7805 1.8685 8.9257 9.2405 1.4017 4.2434 3.9624 5.0939 10.2165 1.4931 1.5340 1.4956 4.5859 11.2632 7.6485 1.0855 1.0949 1.0958 1.0414 1.0413 1.1008 1.1012
irintensity: 3.4703 2.8645 5.7855 0.1837 7.0460 0.0702 5.8376 29.6306 1.7412 19.2862 1.9188 5.2853 7.4859 3.3586 4.9688 12.8131 0.4320 3.6573 4.1869 16.1800 165.4301 59.0000 195.6458 30.5811 46.7911 53.3636 11.3751 3.6436 9.3611 153.7224 192.1611 94.4630 31.9488 25.4001 44.7860 45.5715 107.4656 65.2977 35.7690 31.3930 23.7317 2.8092 74.8098 24.2587 28.7901 28.3062 27.4042 41.5891 41.0112 30.4614 32.6215
temp: 298.150 k
press: 1.00000 atm
elementType: 17 16 16 16 8 8 8 8 7 7 6 6 6 6 1 1 1 1 1
symmnumber: 1
zpe: 264059.3 jmol-1
zpe.correction: 0.100575 hartree
zpe.thermalcorrener: 0.117686 hartree
zpe.thermalcorrenthalpy: 0.118630 hartree
zpe.thermalcorrgfe: 0.054104 hartree
zpe.sumelectzpe: -2218.583772 hartree
zpe.sumelectthermal: -2218.566661 hartree
zpe.sumelectthermalent: -2218.565716 hartree
zpe.sumelectthermalfe: -2218.630242 hartree
dipole: 0.4689 2.1103 0.2380
dipole: 2.1748
quadrupole: -105.6814 -119.9398 -111.7647
quadrupole: -0.8184 -28.6398 3.1033
quadrupole: 6.7805 -7.4778 0.6973 -0.8184 -28.6398 3.1033
hfenergy: -2218.6843467 hartree
pointgroup: C01 [X(C4H5Cl1N2O4S3)]
dipole: 0.1635327 0.8341562 0.0976398 debye
dipolederiv: -0.4113613 -0.3508249 0.0327492 -0.3488506 -0.3414037 0.0193379 0.0352664 0.0278 0.0781693 2.0691124 -0.516276 -0.2652236 -0.4311277 1.4029653 0.064408 -0.2185447 0.024446 1.6010516 2.4701809 0.3037915 -0.2725847 0.346041 1.1939599 -0.0144567 -0.2533865 0.0328034 1.6338874 -0.3742012 0.0319854 0.0362862 0.2090248 -0.0381809 -0.0122883 0.0277949 -0.0040836 0.2575923 -0.7478609 0.10229 -0.0622523 0.0372746 -0.4537553 -0.1293251 -0.0365214 0.0106951 -0.5657285 -0.6588914 0.0488096 0.093221 0.0950007 -0.6869321 0.0797096 0.0216 -0.0605641 -0.4998084 -0.7981336 -0.0282596 -0.0250811 0.0384613 -0.4620192 0.1314118 -0.0034843 -0.0094103 -0.5452153 -0.7048614 -0.0577178 0.0690234 -0.1514367 -0.6706173 -0.1083848 0.0387569 0.032819 -0.5094448 -0.6770242 0.1396161 0.1532249 0.0959203 -0.4561298 0.1059007 0.2399617 0.0854302 -0.8041763 -0.7386119 -0.083404 0.1482734 -0.023811 -0.4665883 -0.1141031 0.2312095 -0.13214 -0.7880522 -0.3655537 -0.0588372 -0.00199 0.1219325 -0.6417818 -0.0112199 -0.0595649 0.0370194 -0.1277163 -0.6357095 -0.0443778 0.0111942 -0.0659883 0.1180613 0.0139804 -0.078984 0.0035883 -0.3331366 0.0223507 0.1205261 -0.0093892 0.0617904 -0.3055193 -0.0026707 0.0058199 -0.002708 -0.0436428 0.6385129 0.3749072 -0.0383116 0.0634756 0.8320594 -0.0102762 -0.0481289 -0.033393 -0.1507873 0.2049163 0.0041372 -0.0124535 -0.0295653 0.1484391 0.0029172 -0.0133935 -0.0015365 0.184318 0.1917952 -0.0494121 0.1149803 -0.0687811 0.1352137 -0.0119 0.0397089 -0.0276526 0.2103154 0.1565125 -0.0074166 -0.0343324 0.0189192 0.2679955 -0.0730758 0.013846 -0.0452078 0.1140207 0.2177901 0.0619871 0.0998366 0.0801622 0.1256279 0.0089906 0.0231425 0.0344965 0.1747221 0.1410383 0.0084759 -0.0371707 -0.0484419 0.2986056 0.0610445 0.0349014 0.0275981 0.1136316 unknown
polarizability: 201.3414376|8.4762584|150.8447726|-8.7220767|0.8618515|98.1027797 unknown
InChI: InChI=1S/C4H5ClN2O4S3/c5-4-2(13(6,8)9)1-3(12-4)14(7,10)11/h1H,6-7H2
charge 0 multiplicity 1
19 atoms
Cl 2.12497 2.626977 -0.086931
S  2.640368 -0.922276 -0.049226
S  -3.063395 -0.440912 0.049827
S  -0.871338 1.871117 0.028517
O  3.668726 -0.262374 1.016082
O  2.212316 -2.491571 -0.007343
O  -3.933433 0.488947 -0.955378
O  -2.996303 -2.060943 -0.079808
N  3.289686 -0.511745 -1.708692
N  -3.578141 0.091066 1.725343
C  1.011342 0.01194 -0.035573
C  -1.299512 0.124133 0.037463
C  -0.216987 -0.727464 -0.001075
C  0.867172 1.38652 -0.027416
H  -0.274465 -1.819057 -0.006824
H  3.169328 -1.323342 -2.33606
H  4.268812 -0.199854 -1.60558
H  -3.408043 -0.665045 2.408656
H  -4.565204 0.393584 1.676419
