program: Gaussian 09
title: 000211040
version: EM64L-G09RevD.01
frameworkgroup: C1[X(C17H21N)]
method: RPBEPBE
basis: SDD
operation: Freq
keyword: #pfreq=noraman
keyword: PBEPBE/SDD
title: #p freq=noraman PBEPBE/SDD
converged: YES YES NO NO
title: Mulliken charges:
elementType: N C C C C C C C C C C C C C C C C C H H H H H H H H H H H H H H H H H H H H H
charge: -0.275699 -0.354092 -0.444095 -0.394887 0.515482 0.453744 -0.457393 -0.396419 -0.391960 -0.419681 -0.322780 -0.227218 -0.231913 -0.230997 -0.248317 -0.248476 -0.245118 -0.691605 0.208558 0.232211 0.188872 0.196826 0.213381 0.236718 0.231142 0.234385 0.242463 0.248703 0.178687 0.208593 0.224013 0.223058 0.222825 0.222491 0.226899 0.226765 0.231639 0.202139 0.211056
chargesum: 0.00000
title: Mulliken charges with hydrogens summed into heavy atoms:
elementType: N C C C C C C C C C C C C C C C C C
charge: -0.038981 -0.145534 -0.023013 0.015320 0.515482 0.453744 -0.226252 -0.162034 -0.149497 -0.170978 0.064500 -0.003205 -0.008855 -0.008172 -0.025826 -0.021577 -0.018353 -0.046770
polarizability: 1.98594984e+02 -1.54738287e+01 1.97761206e+02 5.27589799e+00 -1.57945188e+01 1.55813372e+02
1716.lowfreq: -4.4914 -0.0002 0.0003 0.0005 2.4159 8.1189 21.1144 32.6246 39.2294
frequency: 20.8758 32.5661 39.1434 52.9611 58.2788 60.5201 97.1954 136.2562 166.1614 183.5819 216.8174 219.6903 246.5300 259.7288 295.0371 340.8462 401.2354 404.2065 443.9110 467.8542 477.3713 556.4733 581.6788 614.3223 617.5279 631.0985 674.6248 703.8637 706.9923 734.2880 761.9303 778.9916 810.0826 838.4762 844.7910 852.7828 854.3339 905.3259 921.0623 926.4966 975.7120 976.1976 989.0997 990.5763 993.4256 993.6729 1009.1682 1026.7538 1028.3051 1032.9619 1042.9224 1075.4833 1081.6294 1091.5788 1115.2602 1131.7547 1151.6963 1170.7084 1171.8234 1187.1145 1190.1267 1192.7418 1200.0491 1215.1739 1243.4380 1266.6961 1274.3743 1296.7174 1309.6811 1329.6053 1335.2016 1348.4773 1379.2686 1383.6318 1385.0899 1393.4861 1436.7769 1440.6230 1447.1153 1464.7634 1471.6616 1479.7616 1480.7274 1484.0324 1490.3178 1501.2239 1590.1660 1592.8107 1608.8222 1614.3357 2851.1907 2881.2291 2958.7942 2970.4774 2977.9211 2987.7257 2996.4029 3045.5909 3070.0527 3091.3989 3111.5444 3115.2279 3118.0186 3123.6784 3131.3240 3137.1685 3141.8581 3148.9038 3160.8695 3162.7716 3412.1314
redmass: 3.6385 3.8401 3.8072 1.7087 4.0961 3.7602 3.5871 2.0593 3.5750 2.8270 3.8818 4.3645 1.1936 3.4884 4.3546 3.3268 2.8150 2.8259 3.4381 3.5438 3.3426 3.2533 3.5688 5.6709 6.2830 4.1936 1.4324 1.7593 1.6892 2.4419 1.6695 2.0198 1.1172 2.1366 1.9660 1.2694 1.2539 1.6629 1.4257 1.5626 1.4050 1.3943 5.1406 5.6283 1.3263 1.3396 2.5166 2.3383 2.0859 2.7975 2.3967 1.9035 1.6399 1.8140 1.9688 1.5751 3.2383 1.0617 1.0513 1.1126 2.3480 1.1824 2.3338 1.4360 1.3669 1.2623 1.3865 1.1929 1.3499 1.2778 1.2805 1.3713 5.2569 6.4621 1.3899 1.4002 2.2095 2.1500 1.1783 1.1006 1.0577 2.1134 1.0913 2.1439 1.0920 1.0851 6.0475 5.9998 6.0821 6.0565 1.0720 1.0686 1.0730 1.0751 1.0374 1.0856 1.0859 1.0993 1.0980 1.1002 1.0870 1.0862 1.0861 1.0865 1.0908 1.0922 1.0958 1.0949 1.1014 1.1012 1.0738
irintensity: 0.0527 0.1715 0.0220 1.4217 0.6060 0.1420 0.7382 2.9017 0.8679 1.2756 0.6079 0.5923 0.8182 0.8755 0.2791 1.0761 0.1915 0.1585 1.9357 3.7263 1.4060 19.8878 9.8769 3.3972 1.1480 9.0379 85.8317 50.0734 59.5957 13.5578 49.0488 24.9978 6.3470 0.2176 3.9177 0.4421 0.2420 2.8700 3.3731 1.6347 0.0651 0.0221 0.2589 0.3233 0.3840 0.1861 5.4634 16.8138 7.4853 1.4196 2.9824 12.8034 2.1389 7.6611 10.9839 5.6831 70.0284 0.1207 0.0596 0.4098 0.2507 1.1308 2.2958 0.6350 2.2056 6.5887 0.9226 2.5187 1.1327 6.0755 0.8405 14.8661 1.3290 1.5152 13.2612 8.7406 10.9920 6.6845 26.7323 2.8354 17.9811 18.8977 14.6535 15.4964 2.1559 3.5620 3.6283 0.0797 14.6174 6.4367 99.8673 97.2714 4.6013 20.6831 34.4011 34.0421 35.9273 47.8611 58.6735 37.0317 9.5543 6.3430 3.1111 0.0863 10.4366 22.4689 41.4210 41.1627 29.4908 20.2618 2.6887
temp: 298.150 k
press: 1.00000 atm
elementType: 7 6 6 6 6 6 6 6 6 6 6 6 6 6 6 6 6 6 1 1 1 1 1 1 1 1 1 1 1 1 1 1 1 1 1 1 1 1 1
symmnumber: 1
zpe: 876940.1 jmol-1
zpe.correction: 0.334009 hartree
zpe.thermalcorrener: 0.351507 hartree
zpe.thermalcorrenthalpy: 0.352451 hartree
zpe.thermalcorrgfe: 0.285845 hartree
zpe.sumelectzpe: -713.823396 hartree
zpe.sumelectthermal: -713.805897 hartree
zpe.sumelectthermalent: -713.804953 hartree
zpe.sumelectthermalfe: -713.871560 hartree
dipole: -0.4189 0.9437 0.2893
dipole: 1.0723
quadrupole: -104.8841 -108.0310 -101.6348
quadrupole: -4.0601 0.0322 -4.0088
quadrupole: -0.0342 -3.1810 3.2152 -4.0601 0.0322 -4.0088
hfenergy: -714.1574045 hartree
pointgroup: C01 [X(C17H21N1)]
dipole: -0.1910375 0.36195 0.1023669 debye
polarizability: 201.3447197|-15.3260165|193.8789064|6.0896145|-16.6742038|156.9459367 unknown
InChI: InChI=1S/C17H21N/c1-2-18-14-13-17(15-9-5-3-6-10-15)16-11-7-4-8-12-16/h3-12,17-18H,2,13-14H2,1H3
charge 0 multiplicity 1
39 atoms
N  -3.410346 -1.52941 0.274957
C  0.168926 -0.315573 -0.610074
C  -0.971591 -1.125826 0.06925
C  -2.376264 -0.740119 -0.431767
C  0.085713 1.177882 -0.249352
C  1.57368 -0.873797 -0.318245
C  -0.361652 2.13195 -1.19703
C  2.668585 -0.4120 -1.097033
C  0.43437 1.627998 1.050926
C  1.833505 -1.818643 0.705849
C  -4.795868 -1.283359 -0.183831
C  -0.466545 3.500865 -0.857441
C  3.979069 -0.879196 -0.865095
C  0.326808 2.992488 1.396373
C  3.146997 -2.287156 0.945895
C  -0.125227 3.936017 0.443123
C  4.225265 -1.82129 0.162331
C  -5.800203 -2.117416 0.629869
H  0.009423 -0.393428 -1.706383
H  -0.826467 -2.206873 -0.115141
H  -0.926331 -0.9742 1.16824
H  -2.455336 -0.972058 -1.513934
H  -2.52625 0.36263 -0.328779
H  -3.333956 -1.405403 1.295972
H  -0.630504 1.800479 -2.208251
H  2.487897 0.327445 -1.887471
H  0.809153 0.907421 1.788183
H  1.012861 -2.203486 1.319854
H  -5.081068 -0.201215 -0.131526
H  -4.855035 -1.571718 -1.252281
H  -0.812945 4.223998 -1.604822
H  4.807169 -0.510703 -1.48144
H  0.602536 3.323097 2.40451
H  3.32509 -3.018685 1.742692
H  -0.204182 4.996025 0.709607
H  5.241973 -2.186374 0.346306
H  -5.554528 -3.191286 0.55572
H  -5.780045 -1.833971 1.700118
H  -6.830476 -1.963014 0.261526
