program: Gaussian 09
title: 000216377
version: EM64L-G09RevD.01
frameworkgroup: C1[X(C20H23ClN2O3)]
method: RPBEPBE
basis: SDD
operation: Freq
keyword: #p
keyword: freq=noraman
keyword: PBEPBE/SDD
title: #p freq=noraman PBEPBE/SDD
converged: YES YES NO NO
title: Mulliken charges:
elementType: Cl O O O N N C C C C C C C C C C C C C C C C C C C C H H H H H H H H H H H H H H H H H H H H H H H
charge: -0.101083 -0.289149 -0.477053 -0.298405 -0.029219 -0.430855 -0.208833 0.236858 0.219456 0.028550 -0.045880 -0.351958 -0.260003 -0.417256 -0.662453 -0.338553 -0.340298 -0.215663 -0.380033 -0.297811 0.376530 -0.345675 -0.379228 -0.222675 -0.196630 -0.255264 0.195350 0.220085 0.231604 0.269735 0.265570 0.225496 0.233649 0.267907 0.226348 0.295170 0.257289 0.305897 0.230062 0.222883 0.243445 0.221165 0.215841 0.378145 0.249518 0.245380 0.225134 0.227838 0.229075
chargesum: 0.00000
title: Mulliken charges with hydrogens summed into heavy atoms:
elementType: Cl O O O N N C C C C C C C C C C C C C C C C C C C C
charge: -0.101083 -0.289149 -0.098908 -0.298405 -0.029219 -0.124958 -0.208833 0.236858 0.219456 0.028550 0.149470 0.099731 0.009732 0.073809 0.065451 -0.043384 -0.083009 0.014399 0.086296 0.139195 0.376530 -0.096157 -0.133849 0.002459 0.031208 -0.026189
polarizability: 2.75759225e+02 -1.92457262e+01 2.32305333e+02 -4.13682351e+00 -1.61338006e+01 2.43068409e+02
1716.lowfreq: -10.4121 -5.5711 -3.6195 -0.0012 -0.0009 0.0010 6.5313 15.8288 19.9828
frequency: -7.0870 15.3675 19.9227 31.3835 34.3403 40.1439 69.7988 81.3395 95.3252 109.3118 115.5283 143.7664 158.5374 170.8516 218.7539 229.0113 234.9631 247.3385 254.6720 267.5232 269.7787 281.5854 312.3582 339.8681 346.4721 376.3161 386.4234 412.0811 415.6815 463.4595 479.3533 493.5385 503.6120 526.6923 559.7785 568.6790 598.0498 604.3959 610.1543 632.1726 643.7674 655.0501 692.2215 723.6494 726.4873 744.2180 758.3356 765.0003 786.7354 795.5483 808.4079 822.3850 858.4761 859.8255 881.9009 890.2907 890.8061 892.9123 910.6257 930.4936 960.0978 961.2785 964.8478 980.1231 982.7224 985.6219 1008.4575 1022.8670 1033.0593 1035.5496 1044.1418 1064.2333 1079.2293 1081.8800 1086.0045 1091.4019 1103.6984 1137.4452 1155.1762 1167.6607 1180.9434 1182.1681 1206.9715 1213.5038 1217.9780 1221.6292 1232.5861 1238.9293 1253.6186 1281.2773 1295.2518 1298.6112 1315.4626 1315.9472 1336.2356 1360.8751 1368.2196 1382.5511 1384.1683 1392.4730 1404.9201 1427.5835 1433.8210 1443.8171 1451.6237 1452.9445 1460.1481 1465.0891 1466.4302 1467.8480 1469.4026 1481.6915 1483.2719 1507.8411 1593.3028 1604.2153 1611.9650 1614.3381 2876.9045 2920.5746 2951.7653 2969.5389 2990.9526 2999.3094 3008.3699 3038.1112 3052.0269 3075.0728 3076.2895 3087.0274 3123.6006 3129.5074 3137.8345 3141.9478 3155.5954 3163.6561 3173.1510 3175.2107 3175.3033 3186.3138 3464.9909
redmass: 5.9395 5.0972 5.0348 6.9463 5.3270 4.4841 4.8940 5.3385 6.0369 4.3573 5.0973 4.1717 4.0426 5.6127 1.1295 3.3643 5.1021 3.2240 5.3513 3.2358 3.4993 2.0463 4.5436 2.7806 4.6140 3.4547 5.9779 2.9336 4.1311 3.5933 4.9242 5.8262 2.8760 3.7146 3.7748 4.0029 4.5296 3.9723 6.2753 3.9410 4.8426 4.3795 2.0584 2.7729 1.4092 2.6205 1.6690 3.6052 3.7935 2.5015 3.5672 1.2684 2.4106 1.4597 2.2868 1.5505 1.6587 2.0067 3.4380 2.1430 1.2596 1.3675 1.3383 2.8571 1.3148 3.3993 3.6278 2.0632 2.5272 2.6702 2.0797 2.7357 1.8869 2.0514 1.6363 2.2255 2.2090 2.9946 2.5593 1.0838 1.1752 1.2432 1.3791 2.7372 2.4836 1.2331 2.4245 1.6664 1.4231 1.2785 1.9615 1.2549 1.2589 1.2720 1.2688 1.2776 1.3937 1.4079 1.4344 2.7116 3.3638 4.4413 1.2879 2.3302 1.0981 1.2501 1.0895 1.2586 1.2034 1.4804 1.2965 1.1109 1.8012 7.5654 6.4095 7.7259 6.2550 8.4416 1.0632 1.0815 1.0682 1.0556 1.0375 1.0618 1.0591 1.1061 1.0962 1.1064 1.1031 1.0964 1.1006 1.0847 1.0889 1.0883 1.0924 1.0955 1.1008 1.0938 1.0962 1.0954 1.0747
irintensity: 0.2038 0.0384 0.8822 0.9366 0.8189 0.7036 0.3193 0.1544 1.8162 9.5077 4.5729 6.5498 3.0050 1.0360 0.4469 11.8073 1.2826 4.4956 1.5661 1.9142 3.4483 4.5611 1.0028 4.0006 1.0827 23.1771 30.1854 0.0581 0.7897 2.8197 11.3734 7.0849 12.2450 1.0751 6.1940 2.2682 4.6292 15.7281 0.1056 12.9195 3.1059 4.8367 30.4380 48.9945 21.2068 4.3865 86.1404 12.8866 16.2911 45.0048 20.4784 1.4808 19.7833 16.6086 13.8829 21.7058 17.3096 20.9344 17.9484 10.7729 69.9416 4.6211 5.1751 19.7027 0.3381 16.6518 61.8685 20.8987 64.5822 7.5087 12.8412 51.8724 1.4927 18.5943 15.9537 13.9099 5.1944 67.5499 1.0571 9.4015 43.5342 2.1909 77.1151 119.0110 198.5345 14.2757 27.7970 6.9092 56.7405 35.8028 33.5375 16.8458 3.6662 0.0013 3.4898 8.5952 8.3308 14.0226 14.4412 11.9991 4.9646 29.2783 156.7809 2.3403 21.7446 42.5158 8.3298 100.0490 22.8158 33.5125 37.7034 29.6580 41.4770 7.6472 25.0828 88.3736 78.0106 36.3898 511.5999 105.6005 23.6641 26.6018 13.1261 30.8840 78.9890 30.3604 14.8696 21.3016 8.7012 16.6020 6.1919 2.8352 10.3021 13.9813 31.5924 22.8837 5.7805 5.3243 5.7401 3.9811 12.2423
temp: 298.150 k
press: 1.00000 atm
elementType: 17 8 8 8 7 7 6 6 6 6 6 6 6 6 6 6 6 6 6 6 6 6 6 6 6 6 1 1 1 1 1 1 1 1 1 1 1 1 1 1 1 1 1 1 1 1 1 1 1
symmnumber: 1
zpe: 1030545.0 jmol-1
zpe.correction: 0.392514 hartree
zpe.thermalcorrener: 0.416387 hartree
zpe.thermalcorrenthalpy: 0.417331 hartree
zpe.thermalcorrgfe: 0.336279 hartree
zpe.sumelectzpe: -1569.196821 hartree
zpe.sumelectthermal: -1569.172948 hartree
zpe.sumelectthermalent: -1569.172003 hartree
zpe.sumelectthermalfe: -1569.253055 hartree
dipole: -0.9600 2.4717 -1.4883
dipole: 3.0408
quadrupole: -153.2058 -158.3050 -157.2819
quadrupole: 10.3395 -6.7342 -8.8932
quadrupole: 3.0584 -2.0408 -1.0177 10.3395 -6.7342 -8.8932
hfenergy: -1569.5893344 hartree
pointgroup: C01 [X(C20H23Cl1N2O3)]
dipole: 0.5105777 -0.7081164 -0.8179719 debye
polarizability: 276.1605949|-20.4573621|223.0034101|0.8796124|5.686972|251.968963 unknown
InChI: InChI=1S/C20H23ClN2O3/c1-20(21)14-23-17-8-5-9-18(19(17)20)26-13-15(24)12-22-10-11-25-16-6-3-2-4-7-16/h2-9,14-15,22,24H,10-13H2,1H3
charge 0 multiplicity 1
49 atoms
Cl -1.805491 2.10825 -1.828849
O  -2.305787 -1.406081 -1.347501
O  0.032948 -2.748368 0.253998
O  3.947042 0.289363 -0.17597
N  -4.385661 2.290196 0.788614
N  1.594401 -1.121995 -0.925323
C  -3.547432 1.366644 -1.263026
C  -3.331559 0.378438 -0.149451
C  -2.755499 -0.905551 -0.120153
C  -3.840851 0.964335 1.043701
C  -0.21651 -2.813319 -1.174935
C  -1.727814 -2.761598 -1.459553
C  -4.213334 2.517953 -0.497084
C  0.573499 -1.635698 -1.877707
C  -4.247196 0.896338 -2.537443
C  -2.671692 -1.58511 1.130182
C  -3.799544 0.300919 2.277054
C  -3.195255 -0.985189 2.296577
C  1.608973 0.347928 -0.714701
C  2.635346 0.715126 0.352661
C  5.084199 0.506216 0.624972
C  5.051493 1.112827 1.904932
C  6.312825 0.075012 0.065994
C  6.261356 1.281386 2.618905
C  7.508161 0.250186 0.790671
C  7.490958 0.854361 2.072345
H  0.142406 -3.792601 -1.56843
H  -1.921701 -3.038762 -2.51135
H  -2.260805 -3.468361 -0.79672
H  -4.517985 3.45383 -0.973701
H  -0.131492 -0.819787 -2.111963
H  1.023265 -1.986448 -2.82517
H  -4.358133 1.727214 -3.254095
H  -3.672102 0.082546 -3.005351
H  -5.252331 0.512034 -2.279329
H  -2.134622 -2.533574 1.199099
H  -4.207938 0.764777 3.178776
H  2.546044 -1.460853 -1.11731
H  -3.114783 -1.528387 3.244616
H  1.843605 0.902546 -1.648996
H  0.605954 0.670306 -0.380584
H  2.424689 0.182582 1.301895
H  2.634794 1.808723 0.531535
H  0.813974 -2.073047 0.290131
H  4.111021 1.450792 2.34981
H  6.308356 -0.386381 -0.926591
H  6.235166 1.750005 3.609188
H  8.455682 -0.084774 0.354094
H  8.421766 0.988851 2.632935
