program: Gaussian 09
title: 000211035
version: EM64L-G09RevD.01
frameworkgroup: C1[X(C14H26O4)]
method: RPBEPBE
basis: SDD
operation: Freq
keyword: #pfreq=noraman
keyword: PBEPBE/SDD
title: #p freq=noraman PBEPBE/SDD
converged: YES YES NO NO
title: Mulliken charges:
elementType: O O O O C C C C C C C C C C C C C C H H H H H H H H H H H H H H H H H H H H H H H H H H
charge: -0.430808 -0.430807 -0.225781 -0.225780 0.225819 0.225822 -0.406329 -0.406335 -0.402290 -0.402289 -0.385299 -0.385298 -0.720699 -0.732103 -0.732106 -0.720700 0.125056 0.125057 0.201588 0.222562 0.222562 0.201589 0.208047 0.209630 0.209629 0.208050 0.194855 0.196175 0.194856 0.196174 0.214394 0.242163 0.219653 0.205026 0.237485 0.225506 0.237487 0.205026 0.225504 0.219653 0.214392 0.242166 0.375349 0.375349
chargesum: 0.00000
title: Mulliken charges with hydrogens summed into heavy atoms:
elementType: O O O O C C C C C C C C C C C C C C
charge: -0.055459 -0.055459 -0.225781 -0.225780 0.225819 0.225822 0.017821 0.017816 0.015387 0.015390 0.005731 0.005732 -0.044489 -0.064086 -0.064088 -0.044489 0.125056 0.125057
polarizability: 1.82982573e+02 -1.17808379e+00 1.54102288e+02 2.70235073e+00 1.14025323e+00 1.51548218e+02
1716.lowfreq: -14.8382 -7.2292 -0.0005 0.0003 0.0005 4.1721 8.1297 24.5513 33.5698
frequency: -7.2292 24.5513 33.5698 36.3221 48.4289 49.1801 68.2232 92.6351 106.5598 126.9213 140.5987 162.4425 180.8718 200.7094 207.1068 229.1263 235.8628 241.7666 246.6856 260.5485 269.2054 314.2340 325.0673 342.9619 343.1388 380.6943 411.0850 433.4599 489.7749 492.4047 495.7774 542.4688 552.0597 598.6956 598.9116 690.6685 694.7346 719.8345 728.0083 732.6734 736.8308 774.2768 838.0388 869.7531 878.6994 924.8568 933.5105 945.4817 948.5554 967.4476 996.6200 999.0115 1010.9133 1029.6321 1030.1859 1040.1893 1067.4537 1073.7417 1074.8455 1085.3064 1093.0848 1157.2865 1169.4892 1194.2107 1199.2470 1212.2057 1220.7427 1237.9118 1245.5103 1268.5656 1272.9728 1290.8802 1293.9578 1299.0003 1316.7509 1318.7405 1319.9630 1344.4146 1359.6451 1359.6723 1379.9984 1380.4832 1399.0714 1399.1897 1449.4785 1449.6077 1460.1110 1462.7813 1464.0446 1465.3037 1470.1318 1470.1880 1472.5693 1475.6075 1476.8887 1484.9476 1490.1949 1490.2324 1649.6970 1649.8520 2951.7456 2956.0256 2964.8395 2966.8657 2976.0369 2977.2393 2982.6052 2982.6290 2989.2419 2991.5617 2991.7030 3005.0858 3019.7243 3031.3562 3049.4394 3053.6617 3076.1805 3076.1896 3087.4880 3087.4912 3098.0019 3098.0147 3100.7803 3100.8299 3515.7829 3515.7930
redmass: 4.6674 4.3280 9.2662 12.3181 5.5970 4.2241 1.6228 3.2532 3.5374 1.8190 2.2636 2.4536 1.7232 1.1928 1.4280 1.5610 1.3449 2.6215 1.8548 1.9604 2.3864 3.5854 2.5870 2.9018 2.8558 2.4927 3.7174 3.1058 3.6863 3.4375 3.0185 3.7101 3.4074 1.2241 1.2151 3.6153 3.4800 1.0829 1.9338 4.3915 1.8174 1.3247 1.7510 2.3155 1.8122 1.8933 1.9278 1.4432 1.5427 1.5396 1.4014 1.7049 2.7613 2.8531 2.8367 2.2409 1.6698 2.3768 2.4423 2.4985 1.2647 2.2374 2.8167 2.0421 2.2650 2.3477 1.5713 1.7448 1.5777 1.5807 1.4282 1.1503 1.4057 1.2847 1.4007 1.4847 1.5103 1.4097 1.4632 1.6234 1.2106 1.2189 1.2114 1.2114 1.0745 1.0705 1.0650 1.0894 1.0559 1.0556 1.0525 1.0495 1.0820 1.0526 1.0643 1.0996 1.0673 1.0669 8.5535 8.5514 1.0589 1.0592 1.0613 1.0607 1.0600 1.0593 1.0354 1.0353 1.0941 1.0369 1.0388 1.0979 1.1000 1.1025 1.1031 1.1033 1.1001 1.1001 1.0997 1.0996 1.0999 1.0998 1.0994 1.0994 1.0640 1.0640
irintensity: 0.8379 0.0191 1.4925 0.0000 0.0000 0.0086 0.0000 0.0012 0.0000 0.0139 0.0000 0.0000 0.0804 0.0000 0.0774 0.3197 0.0000 0.0000 0.7550 0.0000 1.3407 0.0000 0.2311 0.0000 12.6770 0.0000 2.3538 12.3680 0.0000 35.4398 0.0000 0.0000 23.3943 246.5668 0.0025 0.0000 24.0139 9.5522 0.0000 55.8054 0.0000 7.0829 0.0000 9.5679 0.0000 11.6536 0.0000 6.0768 0.0000 23.4075 0.0000 6.3610 195.6056 0.0000 0.0000 281.6932 0.0000 6.1169 0.0000 0.0000 12.1804 1.8368 0.0000 0.0000 24.3654 0.0000 11.2959 1.8045 0.0000 11.4001 0.0000 0.0000 0.0000 5.3294 9.7902 9.1349 0.0000 0.0000 5.9280 0.0010 0.0001 22.4497 48.3442 0.0025 0.0000 1.1346 0.0000 2.4469 6.7727 0.0000 0.0004 6.4851 0.0000 24.7197 0.0000 14.7279 44.6038 0.0084 0.2295 429.7502 0.0000 13.2337 0.0000 21.8574 0.0000 123.9471 65.5489 0.0150 0.0000 44.4802 0.0002 0.5555 0.0000 16.5350 0.0000 159.0143 32.2204 3.7420 75.9443 9.7917 0.8168 39.7588 64.3938 0.0901 40.3081 0.3590
temp: 298.150 k
press: 1.00000 atm
elementType: 8 8 8 8 6 6 6 6 6 6 6 6 6 6 6 6 6 6 1 1 1 1 1 1 1 1 1 1 1 1 1 1 1 1 1 1 1 1 1 1 1 1 1 1
symmnumber: 1
zpe: 994899.8 jmol-1
zpe.correction: 0.378937 hartree
zpe.thermalcorrener: 0.400622 hartree
zpe.thermalcorrenthalpy: 0.401566 hartree
zpe.thermalcorrgfe: 0.326761 hartree
zpe.sumelectzpe: -848.546123 hartree
zpe.sumelectthermal: -848.524439 hartree
zpe.sumelectthermalent: -848.523495 hartree
zpe.sumelectthermalfe: -848.598300 hartree
dipole: 0.0000 0.0000 0.0000
dipole: 0.0001
quadrupole: -120.4411 -102.5389 -120.5751
quadrupole: -7.3336 -17.2082 -7.8360
quadrupole: -5.9228 11.9795 -6.0567 -7.3336 -17.2082 -7.8360
hfenergy: -848.9250607 hartree
pointgroup: C01 [X(C14H26O4)]
dipole: -0.0000143 0.000016 -0.0000144 debye
polarizability: 182.9637021|-1.2078089|154.3260348|2.7948735|0.8343693|151.3433417 unknown
InChI: InChI=1S/C14H26O4/c1-13(2,11(15)16)9-7-5-6-8-10-14(3,4)12(17)18/h15,17H,5-10H2,1-4H3
charge 0 multiplicity 1
44 atoms
O  4.757821 1.450265 -1.187901
O  -4.766555 -1.441654 1.203724
O  5.19353 1.525075 1.082775
O  -5.202066 -1.516555 -1.066986
C  4.530268 -0.645659 0.035373
C  -4.538827 0.654207 -0.019631
C  3.08062 -0.831976 -0.529706
C  -3.089171 0.840525 0.545438
C  1.954222 -0.140358 0.269731
C  -1.962777 0.148906 -0.254002
C  0.567892 -0.333204 -0.386518
C  -0.576443 0.341763 0.402236
C  5.535448 -1.343185 -0.92977
C  4.66909 -1.235718 1.458347
C  -4.677643 1.244229 -1.44262
C  -5.543991 1.351769 0.945498
C  4.861893 0.850767 0.082497
C  -4.87044 -0.842224 -0.066722
H  2.885275 -1.923172 -0.571725
H  3.064342 -0.459658 -1.572065
H  -3.072889 0.468214 1.5878
H  -2.893832 1.931722 0.587449
H  1.920815 -0.534359 1.304629
H  2.165721 0.945725 0.353405
H  -2.174271 -0.937178 -0.337668
H  -1.92938 0.542899 -1.288903
H  0.355214 -1.418577 -0.484047
H  0.592059 0.072502 -1.419373
H  -0.363769 1.427137 0.499756
H  -0.600602 -0.063936 1.435094
H  5.308275 -2.424204 -0.974433
H  5.463754 -0.925216 -1.947945
H  6.576204 -1.227593 -0.576012
H  4.387898 -2.304632 1.445266
H  4.027864 -0.709882 2.184694
H  5.708875 -1.151881 1.819531
H  -4.036435 0.718358 -2.168957
H  -4.396428 2.313137 -1.429572
H  -5.717433 1.160408 -1.803795
H  -6.584752 1.236174 0.591754
H  -5.316813 2.432789 0.990126
H  -5.472295 0.933832 1.963685
H  4.988506 2.415048 -1.104887
H  -4.997273 -2.406431 1.120734
